program: Gaussian 09
title: 000066043
version: EM64L-G09RevD.01
frameworkgroup: C1[X(C8H10S2)]
method: RPBEPBE
basis: SDD
operation: Freq
keyword: #pfreq=noraman
keyword: PBEPBE/SDD
title: #p freq=noraman PBEPBE/SDD
converged: YES YES NO NO
title: Mulliken charges:
elementType: S S C C C C C C C C H H H H H H H H H H
charge: -0.030002 -0.030001 0.499607 0.499599 -0.334634 -0.334606 -0.402644 -0.402677 -0.862939 -0.862933 0.244108 0.244115 0.233676 0.233675 0.268834 0.281069 0.281072 0.268833 0.102923 0.102925
chargesum: 0.00000
title: Mulliken charges with hydrogens summed into heavy atoms:
elementType: S S C C C C C C C C
charge: 0.072921 0.072924 0.499607 0.499599 -0.090526 -0.090491 -0.168968 -0.169002 -0.313036 -0.313028
polarizability: 1.64969572e+02 -3.98080765e-04 9.95655445e+01 -6.91233178e-04 -7.45202959e+00 9.28881819e+01
1716.lowfreq: -12.5932 -8.4209 -0.0029 -0.0023 0.0007 5.6611 23.2469 40.1587 57.9467
frequency: 22.6579 40.0885 57.8581 134.1243 179.8696 191.9110 197.7295 281.0527 353.8932 372.9434 403.8083 443.1801 548.7233 609.8381 638.6809 638.8235 737.0021 748.6772 768.0234 789.3994 825.8783 840.2985 845.6981 947.4597 956.6714 971.1538 976.3806 1011.7352 1110.0479 1158.0973 1162.1327 1189.6108 1221.5995 1223.3933 1249.2045 1250.3267 1315.3882 1385.7988 1410.9781 1452.8967 1454.4919 1504.8719 1582.7521 1620.5963 2435.7916 2435.9008 3032.2636 3032.5538 3102.2009 3102.4639 3113.9352 3125.8517 3136.5141 3149.1799
redmass: 2.9494 5.4984 6.5332 4.2183 1.1686 1.2483 5.2426 2.1925 2.7634 3.9251 2.9677 4.0628 3.7812 4.8723 3.4363 5.4772 3.6764 2.3478 1.2351 1.6158 3.3531 1.7838 1.2642 1.3289 1.5607 1.4210 1.4781 2.8707 1.3611 1.0533 1.0682 1.1210 1.9452 4.5170 1.2554 1.2547 1.2585 5.8506 2.8606 1.1086 1.1178 2.7011 6.6337 6.3846 1.0384 1.0384 1.0583 1.0583 1.1068 1.1071 1.0875 1.0874 1.0966 1.0974
irintensity: 0.1064 0.7807 0.2230 0.0010 13.8841 44.6231 1.4896 6.8885 0.0915 8.0527 0.0185 1.8119 9.9966 3.9501 58.6145 0.5586 6.1253 11.2230 0.7633 2.2574 5.8806 30.9454 0.8237 0.5356 9.7543 0.0779 0.4936 2.7762 21.7032 0.0013 2.5474 0.2275 4.9178 1.0827 7.8439 3.4269 0.0436 1.0890 8.2576 7.9939 11.6987 15.0306 0.1411 0.5463 14.4943 35.9419 18.3230 27.6415 0.0007 12.2461 12.6454 7.9524 28.4098 4.9162
temp: 298.150 k
press: 1.00000 atm
elementType: 16 16 6 6 6 6 6 6 6 6 1 1 1 1 1 1 1 1 1 1
symmnumber: 1
zpe: 397712.9 jmol-1
zpe.correction: 0.151481 hartree
zpe.thermalcorrener: 0.162582 hartree
zpe.thermalcorrenthalpy: 0.163527 hartree
zpe.thermalcorrgfe: 0.112162 hartree
zpe.sumelectzpe: -1106.217982 hartree
zpe.sumelectthermal: -1106.206881 hartree
zpe.sumelectthermalent: -1106.205936 hartree
zpe.sumelectthermalfe: -1106.257301 hartree
dipole: -0.0002 2.3893 -0.4497
dipole: 2.4313
quadrupole: -87.4333 -76.0198 -68.7703
quadrupole: 0.0003 0.0015 -2.2175
quadrupole: -10.0255 1.3880 8.6375 0.0003 0.0015 -2.2175
hfenergy: -1106.369463 hartree
pointgroup: C01 [X(C8H10S2)]
dipole: 0.0000822 -0.7011788 0.6506159 debye
dipolederiv: -0.3821885 -0.153893 -0.0470384 -0.196186 0.0017481 0.0169719 -0.2584245 0.0708043 -0.2258649 -0.3822466 0.1538399 0.0470535 0.1960758 0.0017939 0.0170537 0.2584101 0.0708962 -0.2257937 0.1445582 -0.0217472 0.0639175 -0.0030959 -0.0305718 0.0330787 0.0477639 0.0097814 -0.1405847 0.144585 0.0217756 -0.0638796 0.0031174 -0.0305878 0.0331168 -0.047643 0.0098122 -0.1405965 -0.0965185 -0.0888113 0.0057803 -0.0902499 0.049557 -0.0279306 0.0671713 -0.0499591 -0.1210687 -0.0965278 0.0888065 -0.0057858 0.0902541 0.0495493 -0.0279199 -0.0671905 -0.049962 -0.1210654 -0.0997562 0.0755537 -0.0443028 0.0815292 0.0526856 -0.0455479 -0.0626635 -0.0353421 -0.1302603 -0.099783 -0.0755752 0.0443141 -0.0815385 0.0526859 -0.0455636 0.0626514 -0.0353409 -0.1302545 0.3323458 0.008506 0.0769626 0.086052 0.0865861 0.0234779 0.2140653 -0.0713179 0.3688881 0.3323616 -0.0084617 -0.07698 -0.0859982 0.0865767 0.0233952 -0.2141286 -0.0714033 0.3688334 0.030884 0.0917587 -0.0002367 0.0836966 -0.0222244 0.0270069 -0.0139564 0.035706 0.1341826 0.0309033 -0.0917535 0.0002282 -0.0836935 -0.0222189 0.0270007 0.0139553 0.0357045 0.1341874 0.0101997 -0.1045766 0.0336354 -0.0986477 -0.0449821 0.0315385 0.0108366 0.0320622 0.1350731 0.0101965 0.104579 -0.0336397 0.098649 -0.0449744 0.0315433 -0.0108346 0.0320696 0.1350727 0.0141269 0.0104922 -0.037876 -0.0895209 -0.062057 0.1061956 -0.0243206 0.0802528 -0.0445562 -0.0082201 0.0302585 0.0010576 0.0857107 0.0128663 -0.0793485 0.0020926 -0.0535944 0.0124261 -0.0082472 -0.0302658 -0.0010738 -0.0857044 0.0129155 -0.079348 -0.0021083 -0.0535986 0.0123908 0.0141328 -0.0105102 0.0378838 0.0895173 -0.0621075 0.1061937 0.0243382 0.0802608 -0.0444956 0.054567 0.1536623 0.0406551 0.1534383 -0.0436097 -0.085438 -0.0019699 -0.0183988 0.01176 0.0546272 -0.1536378 -0.0406755 -0.1534055 -0.043631 -0.0854765 0.0019554 -0.018433 0.0117262 unknown
polarizability: 164.969571|0.0050156|102.373797|0.0043132|-5.3753832|90.07993 unknown
InChI: InChI=1S/C8H10S2/c9-5-7-1-2-8(6-10)4-3-7/h1-4,9-10H,5-6H2
charge 0 multiplicity 1
20 atoms
S  -3.726033 0.260607 -1.33028
S  3.726081 0.261271 -1.329897
C  -1.431559 -0.065569 0.376947
C  1.431471 -0.065526 0.377029
C  -0.703356 1.138419 0.17332
C  0.703246 1.13844 0.173357
C  -0.70708 -1.266468 0.57579
C  0.707018 -1.266447 0.575829
C  -2.941586 -0.072692 0.387182
C  2.941502 -0.072602 0.387383
H  -1.251822 2.071716 0.000217
H  1.251698 2.07175 0.000279
H  -1.249485 -2.205924 0.739255
H  1.249441 -2.205887 0.739321
H  -3.34268 -1.028679 0.758983
H  -3.356792 0.745764 0.99869
H  3.356626 0.745671 0.999194
H  3.342589 -1.028693 0.758923
H  -3.060348 -0.759027 -1.991587
H  3.060668 -0.758325 -1.991535
