program: Orca
programVersion: 5.0.2
elementType: S S O N N N N C C C C C C C C C C C C C C H H H H H H H H H H H H H H H H
charge: 0
multiplicity: 1
keywords: wb97x-d3
keywords: def2-TZVPP
keywords: def2/J RIJCOSX
keywords: DEFGRID2
keywords: scfconv7
keywords: smallprint printgap noloewdin
keywords: NOSOSCF
formula: C14H16N4OS2
InChI: InChI=1/C14H16N4OS2/c1-3-9-12(21-14(18-9)16-4-2)13(19)17-10(8-15)11-6-5-7-20-11/h5-7,10,16-17H,3-4H2,1-2H3
37 atoms
S  -2.090228 0.49802 1.351115
S  3.84459 0.836946 -1.327356
O  0.602955 -0.35776 1.8180
N  1.206322 -1.011844 -0.255733
N  -3.04996 -0.1257 -0.956552
N  -4.572311 0.94113 0.450447
N  3.650653 -3.084713 -1.320346
C  -1.763516 -0.537018 -0.967698
C  -1.053575 -0.282117 0.18457
C  -1.242829 -1.230218 -2.193455
C  2.577556 -1.20875 0.151879
C  -3.367576 0.440439 0.185357
C  0.298253 -0.546161 0.644119
C  3.421769 0.033893 0.136628
C  -2.31794 -1.656067 -3.181203
C  -4.956659 1.483803 1.73631
C  3.90953 0.695523 1.221674
C  -6.351648 2.066466 1.675965
C  4.636731 1.863478 0.869675
C  3.170921 -2.260538 -0.679748
C  4.677983 2.06479 -0.474708
H  -0.537596 -0.565648 -2.704404
H  -0.667934 -2.109048 -1.891307
H  2.581116 -1.59043 1.17641
H  1.025102 -0.921389 -1.244008
H  -2.863604 -0.804135 -3.583729
H  -3.040521 -2.333079 -2.726535
H  -1.855778 -2.179808 -4.018239
H  -5.280861 0.805793 -0.256262
H  -4.912072 0.704519 2.504271
H  -4.246807 2.263603 2.027565
H  3.755975 0.357859 2.237304
H  -6.408932 2.893922 0.96883
H  -7.086646 1.313964 1.387963
H  -6.633579 2.444736 2.657617
H  5.104725 2.523177 1.585922
H  5.160938 2.866847 -1.012695
elementType: S O N C H
totalener: -1633.85697370 hartree
nucrepener: 1868.80437645 hartree
electener: -3502.66135015 hartree
oneelecener: -5951.77476305 hartree
twoeener: 2449.11341290 hartree
cpcmener: -0.03705198 hartree
kineticenergy: 1628.86977692 hartree
xcener: -119.651416893338 hartree
chargesum: 0.0000000
charge: 0.003439 0.049406 -0.526033 -0.215887 -0.403367 -0.180777 -0.091500 0.149064 -0.125471 -0.135713 0.308678 0.226401 0.381389 -0.043431 -0.271751 -0.010726 -0.204210 -0.272169 -0.193207 -0.211730 -0.157064 0.097469 0.099335 0.136504 0.198709 0.079801 0.087331 0.093431 0.168685 0.103066 0.095941 0.160616 0.094193 0.089609 0.089973 0.164786 0.165209
qa: 0.0034 0.0494 -0.5260 -0.2159 -0.4034 -0.1808 -0.0915 0.1491 -0.1255 -0.1357 0.3087 0.2264 0.3814 -0.0434 -0.2718 -0.0107 -0.2042 -0.2722 -0.1932 -0.2117 -0.1571 0.0975 0.0993 0.1365 0.1987 0.0798 0.0873 0.0934 0.1687 0.1031 0.0959 0.1606 0.0942 0.0896 0.0900 0.1648 0.1652
va: 2.7006 2.7686 1.9917 3.2079 2.9914 3.1811 3.1096 3.8722 3.6669 3.8622 3.7819 4.2191 4.1710 3.7073 3.9552 3.8485 3.9580 3.9671 3.9838 4.0659 3.9972 0.9946 1.0022 1.0286 0.9995 1.0097 1.0062 1.0039 1.0203 0.9918 0.9901 1.0051 1.0016 0.9997 1.0053 0.9936 0.9941
dispcorr: -0.015912795 hartree
energy: -1633.872886498301
dipole: -25.33171 23.18100 -2.15071 4.88530 -2.99540 1.88990 -2.20536 2.19535 -0.01001
magnitude: 2.86310 au
magnitude: 7.27743 debye
