program: Orca
programVersion: 5.0.2
elementType: S S O N N N N C C C C C C C C C C C C C C H H H H H H H H H H H H H H H H
charge: 0
multiplicity: 1
keywords: wb97x-d3
keywords: def2-TZVPP
keywords: def2/J RIJCOSX
keywords: DEFGRID2
keywords: scfconv7
keywords: smallprint printgap noloewdin
keywords: NOSOSCF
formula: C14H16N4OS2
InChI: InChI=1/C14H16N4OS2/c1-3-9-12(21-14(18-9)16-4-2)13(19)17-10(8-15)11-6-5-7-20-11/h5-7,10,16-17H,3-4H2,1-2H3
37 atoms
S  -2.13028 0.491507 1.363967
S  3.883408 0.886398 -1.31945
O  0.589827 -0.328341 1.82014
N  1.197715 -0.913642 -0.273543
N  -3.076147 -0.148671 -0.945655
N  -4.639897 0.815505 0.488184
N  3.574555 -3.015469 -1.405846
C  -1.775991 -0.513311 -0.964407
C  -1.071455 -0.244864 0.188415
C  -1.23388 -1.173115 -2.199477
C  2.56459 -1.150743 0.12483
C  -3.412015 0.387688 0.205412
C  0.285819 -0.488656 0.642019
C  3.443457 0.067549 0.131161
C  -2.294117 -1.624681 -3.191335
C  -5.015745 1.435834 1.740503
C  3.965619 0.686454 1.225512
C  -6.513963 1.64331 1.803702
C  4.733671 1.83364 0.892084
C  3.125966 -2.196638 -0.736822
C  4.774172 2.060735 -0.448269
H  -0.553006 -0.477911 -2.703154
H  -0.627986 -2.035024 -1.908993
H  2.562165 -1.554191 1.140935
H  1.014452 -0.795827 -1.258323
H  -2.88481 -0.790726 -3.566849
H  -2.978216 -2.349079 -2.750008
H  -1.812987 -2.102207 -4.045076
H  -5.319282 0.762102 -0.256876
H  -4.70044 0.796262 2.571049
H  -4.500419 2.394809 1.859411
H  3.808485 0.331715 2.234827
H  -6.860878 2.296025 1.001469
H  -7.049527 0.696046 1.733219
H  -6.781922 2.110189 2.750337
H  5.233448 2.459071 1.617817
H  5.282444 2.855779 -0.973314
elementType: S O N C H
totalener: -1633.85698119 hartree
nucrepener: 1865.99965214 hartree
electener: -3499.85663333 hartree
oneelecener: -5946.16408066 hartree
twoeener: 2446.30744733 hartree
cpcmener: -0.03723252 hartree
kineticenergy: 1628.86567515 hartree
xcener: -119.650752370897 hartree
chargesum: -0.0000000
charge: 0.002676 0.048788 -0.526380 -0.212659 -0.403780 -0.180298 -0.091538 0.148150 -0.128778 -0.133213 0.307700 0.227754 0.382488 -0.040813 -0.272067 -0.012492 -0.207640 -0.272417 -0.191347 -0.211772 -0.158015 0.097239 0.098845 0.136347 0.198147 0.079502 0.087920 0.093376 0.169101 0.094990 0.104400 0.161022 0.091398 0.093516 0.090214 0.164701 0.164934
qa: 0.0027 0.0488 -0.5264 -0.2127 -0.4038 -0.1803 -0.0915 0.1482 -0.1288 -0.1332 0.3077 0.2278 0.3825 -0.0408 -0.2721 -0.0125 -0.2076 -0.2724 -0.1913 -0.2118 -0.1580 0.0972 0.0988 0.1363 0.1981 0.0795 0.0879 0.0934 0.1691 0.0950 0.1044 0.1610 0.0914 0.0935 0.0902 0.1647 0.1649
va: 2.6988 2.7684 1.9916 3.2060 2.9912 3.1818 3.1089 3.8763 3.6696 3.8635 3.7770 4.2176 4.1727 3.7072 3.9542 3.8486 3.9593 3.9656 3.9820 4.0680 3.9983 0.9946 1.0027 1.0293 1.0002 1.0103 1.0057 1.0039 1.0203 0.9915 0.9910 1.0047 0.9992 1.0018 1.0056 0.9935 0.9944
dispcorr: -0.015879874 hartree
energy: -1633.872861063202
dipole: -25.40235 23.30105 -2.10130 3.94380 -2.01737 1.92643 -1.96060 1.95821 -0.00239
magnitude: 2.85072 au
magnitude: 7.24596 debye
