program: Orca
programVersion: 5.0.2
elementType: S S O N N N N C C C C C C C C C C C C C C H H H H H H H H H H H H H H H H
charge: 0
multiplicity: 1
keywords: wb97x-d3
keywords: def2-TZVPP
keywords: def2/J RIJCOSX
keywords: DEFGRID2
keywords: scfconv7
keywords: smallprint printgap noloewdin
keywords: NOSOSCF
formula: C14H16N4OS2
InChI: InChI=1/C14H16N4OS2/c1-3-9-12(21-14(18-9)16-4-2)13(19)17-10(8-15)11-6-5-7-20-11/h5-7,10,16-17H,3-4H2,1-2H3
37 atoms
S  -2.64762 -1.095433 -1.112308
S  3.537234 -1.248152 1.63948
O  0.072123 -2.004971 -1.32632
N  1.163962 -0.155507 -0.631018
N  -2.97584 0.97947 0.375829
N  -4.969912 0.06979 -0.42286
N  3.364204 0.136861 -3.206346
C  -1.635365 0.787582 0.291503
C  -1.239863 -0.273838 -0.483353
C  -0.770867 1.752853 1.040344
C  2.479879 -0.686492 -0.881907
C  -3.639536 0.085416 -0.313986
C  0.035821 -0.879614 -0.841265
C  3.435058 -0.298329 0.209297
C  -0.52788 3.038267 0.250765
C  -5.82663 0.970687 0.325349
C  4.221845 0.810872 0.29394
C  -6.059358 0.535611 1.76206
C  4.915503 0.894102 1.530272
C  2.987191 -0.226771 -2.183624
C  4.640217 -0.153227 2.353569
H  -1.284576 1.998303 1.971524
H  0.174594 1.294508 1.33205
H  2.400028 -1.774794 -0.950152
H  1.1150 0.824856 -0.40383
H  0.080227 3.73231 0.831195
H  -1.468619 3.535323 0.01323
H  -0.008757 2.847487 -0.690143
H  -5.409548 -0.713552 -0.879119
H  -5.391972 1.969384 0.295251
H  -6.773664 1.022048 -0.210884
H  4.304814 1.547836 -0.493844
H  -6.722206 1.242307 2.263421
H  -6.526089 -0.449195 1.807416
H  -5.126113 0.498387 2.324326
H  5.59156 1.695439 1.791018
H  5.032669 -0.343491 3.341528
elementType: S O N C H
totalener: -1633.85698726 hartree
nucrepener: 1874.89953482 hartree
electener: -3508.75652207 hartree
oneelecener: -5963.62410841 hartree
twoeener: 2454.86758634 hartree
cpcmener: -0.03765801 hartree
kineticenergy: 1628.86455234 hartree
xcener: -119.648425080171 hartree
chargesum: 0.0000000
charge: 0.016790 0.060958 -0.519791 -0.213175 -0.407613 -0.204894 -0.095265 0.082624 -0.092588 -0.124918 0.334208 0.248056 0.381477 -0.070558 -0.257258 0.016947 -0.171620 -0.256260 -0.211360 -0.223914 -0.152080 0.085405 0.073731 0.126348 0.204756 0.097177 0.092062 0.083113 0.169689 0.082204 0.098403 0.158444 0.089684 0.082756 0.083610 0.166194 0.166657
qa: 0.0168 0.0610 -0.5198 -0.2132 -0.4076 -0.2049 -0.0953 0.0826 -0.0926 -0.1249 0.3342 0.2481 0.3815 -0.0706 -0.2573 0.0169 -0.1716 -0.2563 -0.2114 -0.2239 -0.1521 0.0854 0.0737 0.1263 0.2048 0.0972 0.0921 0.0831 0.1697 0.0822 0.0984 0.1584 0.0897 0.0828 0.0836 0.1662 0.1667
va: 2.6706 2.7698 1.9986 3.2166 2.9589 3.2352 3.1129 3.9530 3.6530 3.9237 3.7414 4.1484 4.1406 3.8095 3.9035 3.8430 3.9156 3.9152 3.9995 4.0864 3.9847 1.0199 1.0190 1.0478 0.9956 1.0048 1.0093 1.0067 1.0091 1.0182 0.9981 1.0059 1.0076 1.0062 1.0125 0.9937 0.9923
dispcorr: -0.016947400 hartree
energy: -1633.873934657715
dipole: -18.71867 17.21982 -1.49885 17.67659 -16.20693 1.46966 11.80493 -9.37458 2.43036
magnitude: 3.21140 au
magnitude: 8.16273 debye
