program: Orca
programVersion: 5.0.2
elementType: S S O N N N N C C C C C C C C C C C C C C H H H H H H H H H H H H H H H H
charge: 0
multiplicity: 1
keywords: wb97x-d3
keywords: def2-TZVPP
keywords: def2/J RIJCOSX
keywords: DEFGRID2
keywords: scfconv7
keywords: smallprint printgap noloewdin
keywords: NOSOSCF
formula: C14H16N4OS2
InChI: InChI=1/C14H16N4OS2/c1-3-9-12(21-14(18-9)16-4-2)13(19)17-10(8-15)11-6-5-7-20-11/h5-7,10,16-17H,3-4H2,1-2H3
37 atoms
S  -2.168989 -0.761117 1.372845
S  3.254723 -0.31205 1.763406
O  0.412822 -1.89346 0.795016
N  1.088162 -0.518217 -0.866416
N  -3.101644 0.782075 -0.465995
N  -4.577792 0.431864 1.303495
N  3.384949 -1.188667 -3.243408
C  -1.847737 0.44723 -0.858834
C  -1.15826 -0.367749 0.003566
C  -1.379342 1.00014 -2.167258
C  2.442872 -1.017893 -0.811284
C  -3.412348 0.23744 0.684546
C  0.157918 -0.985907 0.011043
C  3.342073 -0.17657 0.050364
C  -0.882637 2.438652 -2.037052
C  -5.665352 1.180816 0.701421
C  4.224256 0.790401 -0.327321
C  -6.421223 0.407476 -0.365581
C  4.838866 1.4310 0.781862
C  2.973701 -1.110756 -2.173903
C  4.406838 0.93686 1.973079
H  -0.609279 0.367639 -2.608922
H  -2.225174 0.975518 -2.856913
H  2.405948 -2.040784 -0.427352
H  0.981888 0.412238 -1.243527
H  -1.66424 3.089549 -1.644616
H  -0.581387 2.827055 -3.009986
H  -0.023255 2.513232 -1.367986
H  -4.780284 -0.092262 2.13975
H  -6.337743 1.460074 1.511569
H  -5.266813 2.107507 0.288118
H  4.432745 1.043035 -1.358633
H  -7.238303 1.015416 -0.756689
H  -5.773841 0.142718 -1.201412
H  -6.851649 -0.509265 0.039192
H  5.569518 2.222087 0.692565
H  4.709143 1.237557 2.965406
elementType: S O N C H
totalener: -1633.85689832 hartree
nucrepener: 1890.63228231 hartree
electener: -3524.48918064 hartree
oneelecener: -5995.34396024 hartree
twoeener: 2470.85477960 hartree
cpcmener: -0.03598780 hartree
kineticenergy: 1628.87330962 hartree
xcener: -119.649867653188 hartree
chargesum: 0.0000000
charge: 0.016197 0.058768 -0.511386 -0.217433 -0.409936 -0.202788 -0.093956 0.086312 -0.085055 -0.131572 0.340801 0.248995 0.374121 -0.044035 -0.256635 0.013054 -0.217785 -0.255144 -0.196839 -0.221558 -0.158933 0.081481 0.085452 0.135522 0.202479 0.090548 0.097253 0.081754 0.170657 0.098894 0.082274 0.153432 0.090007 0.084646 0.081656 0.165538 0.163213
qa: 0.0162 0.0588 -0.5114 -0.2174 -0.4099 -0.2028 -0.0940 0.0863 -0.0851 -0.1316 0.3408 0.2490 0.3741 -0.0440 -0.2566 0.0131 -0.2178 -0.2551 -0.1968 -0.2216 -0.1589 0.0815 0.0855 0.1355 0.2025 0.0905 0.0973 0.0818 0.1707 0.0989 0.0823 0.1534 0.0900 0.0846 0.0817 0.1655 0.1632
va: 2.6694 2.7882 1.9990 3.2023 2.9545 3.2340 3.1094 3.9383 3.6644 3.9181 3.7663 4.1482 4.1333 3.8003 3.9062 3.8464 3.9496 3.9036 3.9878 4.0658 3.9986 1.0216 1.0182 1.0362 0.9937 1.0101 1.0047 1.0066 1.0089 0.9981 1.0162 1.0103 1.0077 1.0151 1.0069 0.9935 0.9945
dispcorr: -0.016985618 hartree
energy: -1633.873883942398
dipole: -21.50808 19.74158 -1.76650 15.36558 -13.33859 2.02699 -8.57937 9.70642 1.12705
magnitude: 2.91539 au
magnitude: 7.41032 debye
