program: Orca
programVersion: 5.0.2
elementType: S S O N N N N C C C C C C C C C C C C C C H H H H H H H H H H H H H H H H
charge: 0
multiplicity: 1
keywords: wb97x-d3
keywords: def2-TZVPP
keywords: def2/J RIJCOSX
keywords: DEFGRID2
keywords: scfconv7
keywords: smallprint printgap noloewdin
keywords: NOSOSCF
formula: C14H16N4OS2
InChI: InChI=1/C14H16N4OS2/c1-3-9-12(21-14(18-9)16-4-2)13(19)17-10(8-15)11-6-5-7-20-11/h5-7,10,16-17H,3-4H2,1-2H3
37 atoms
S  -2.630383 -0.446525 -1.608731
S  3.448038 -1.422985 1.519813
O  0.069705 -1.313019 -2.024941
N  1.170914 -0.00912 -0.554744
N  -2.979644 1.123202 0.400411
N  -4.954902 0.553867 -0.696941
N  3.321731 0.632328 -3.123208
C  -1.643529 0.913048 0.320496
C  -1.23722 0.091572 -0.703032
C  -0.796382 1.533868 1.388876
C  2.463854 -0.521361 -0.931655
C  -3.630529 0.484625 -0.5416
C  0.034355 -0.455782 -1.148483
C  3.444177 -0.331477 0.188726
C  -0.383513 0.525373 2.458644
C  -5.810676 1.219218 0.26878
C  4.334997 0.681215 0.376139
C  -6.040454 0.413142 1.535693
C  5.03677 0.569628 1.606063
C  2.956793 0.128827 -2.157116
C  4.660972 -0.522236 2.324223
H  0.081412 2.029315 0.968802
H  -1.383577 2.328615 1.849571
H  2.363895 -1.583855 -1.169958
H  1.170304 0.84277 -0.016531
H  0.204023 -0.293871 2.044542
H  -1.260007 0.094815 2.943439
H  0.218655 1.010754 3.226869
H  -5.398968 -0.069927 -1.35123
H  -5.376314 2.189684 0.507956
H  -6.757952 1.412149 -0.233594
H  4.491025 1.4822 -0.334094
H  -6.704519 0.957518 2.208468
H  -6.504611 -0.548867 1.315278
H  -5.106415 0.22925 2.066657
H  5.789569 1.270699 1.936219
H  5.031948 -0.84667 3.28501
elementType: S O N C H
totalener: -1633.85640992 hartree
nucrepener: 1884.86560141 hartree
electener: -3518.72201133 hartree
oneelecener: -5983.59155803 hartree
twoeener: 2464.86954670 hartree
cpcmener: -0.03852390 hartree
kineticenergy: 1628.87823875 hartree
xcener: -119.651194536109 hartree
chargesum: 0.0000000
charge: 0.021757 0.055832 -0.522300 -0.214140 -0.396587 -0.206511 -0.094805 0.076953 -0.101774 -0.114477 0.351598 0.255022 0.377723 -0.088873 -0.262383 0.017899 -0.160079 -0.257478 -0.213436 -0.231575 -0.149701 0.081807 0.085920 0.127407 0.198632 0.071116 0.098326 0.098177 0.170318 0.081973 0.098468 0.156269 0.090134 0.082748 0.084416 0.166094 0.165527
qa: 0.0218 0.0558 -0.5223 -0.2141 -0.3966 -0.2065 -0.0948 0.0770 -0.1018 -0.1145 0.3516 0.2550 0.3777 -0.0889 -0.2624 0.0179 -0.1601 -0.2575 -0.2134 -0.2316 -0.1497 0.0818 0.0859 0.1274 0.1986 0.0711 0.0983 0.0982 0.1703 0.0820 0.0985 0.1563 0.0901 0.0827 0.0844 0.1661 0.1655
va: 2.6793 2.7578 1.9974 3.2144 2.9706 3.2344 3.1124 3.9796 3.6747 3.8952 3.7422 4.1339 4.1224 3.8106 3.9183 3.8435 3.9107 3.9130 4.0001 4.0671 3.9812 1.0101 1.0257 1.0324 1.0036 1.0159 1.0038 1.0044 1.0089 1.0179 0.9984 1.0077 1.0077 1.0065 1.0137 0.9940 0.9928
dispcorr: -0.017628609 hartree
energy: -1633.874038529729
dipole: -18.02482 16.56809 -1.45673 9.02899 -8.26334 0.76565 18.55240 -15.56316 2.98924
magnitude: 3.41231 au
magnitude: 8.67340 debye
