program: Orca
programVersion: 5.0.2
elementType: S S O N N N N C C C C C C C C C C C C C C H H H H H H H H H H H H H H H H
charge: 0
multiplicity: 1
keywords: wb97x-d3
keywords: def2-TZVPP
keywords: def2/J RIJCOSX
keywords: DEFGRID2
keywords: scfconv7
keywords: smallprint printgap noloewdin
keywords: NOSOSCF
formula: C14H16N4OS2
InChI: InChI=1/C14H16N4OS2/c1-3-9-12(21-14(18-9)16-4-2)13(19)17-10(8-15)11-6-5-7-20-11/h5-7,10,16-17H,3-4H2,1-2H3
37 atoms
S  -2.641151 0.343743 -1.271684
S  3.570673 -0.581444 1.536479
O  0.103689 -0.156323 -2.16674
N  1.169336 0.490665 -0.275474
N  -2.905735 0.222719 1.28694
N  -4.920014 0.480883 0.14896
N  3.518946 2.850422 -0.922268
C  -1.575825 0.153861 1.04736
C  -1.213669 0.226311 -0.276412
C  -0.648748 -0.022097 2.214036
C  2.483623 0.444288 -0.860418
C  -3.5944 0.343508 0.177522
C  0.055174 0.16187 -0.985039
C  3.42822 -0.504986 -0.177901
C  -1.293634 -0.692199 3.418197
C  -5.7221 0.502555 -1.055295
C  4.291324 -1.366322 -0.782685
C  -6.0055 -0.875233 -1.629882
C  5.073215 -2.102883 0.146799
C  3.061288 1.796397 -0.899179
C  4.786164 -1.782256 1.436415
H  0.218611 -0.607507 1.903927
H  -0.262196 0.959009 2.511892
H  2.379527 0.1164 -1.898151
H  1.063005 0.971733 0.605324
H  -1.675796 -1.682473 3.168922
H  -2.117473 -0.10585 3.821189
H  -0.553433 -0.813439 4.209518
H  -5.389543 0.396535 1.038523
H  -6.656878 1.003244 -0.806737
H  -5.231729 1.137644 -1.79824
H  4.365313 -1.471567 -1.856484
H  -6.556706 -1.490579 -0.918196
H  -6.610139 -0.784043 -2.532907
H  -5.090084 -1.404235 -1.897501
H  5.80967 -2.841846 -0.133885
H  5.215874 -2.193513 2.337552
elementType: S O N C H
totalener: -1633.85481325 hartree
nucrepener: 1876.15689051 hartree
electener: -3510.01170376 hartree
oneelecener: -5966.22007103 hartree
twoeener: 2456.20836727 hartree
cpcmener: -0.03763809 hartree
kineticenergy: 1628.86803341 hartree
xcener: -119.651245220854 hartree
chargesum: -0.0000000
charge: -0.000210 0.039411 -0.514096 -0.231249 -0.405673 -0.197023 -0.097281 0.150660 -0.132536 -0.124736 0.329732 0.232616 0.375329 -0.009217 -0.268857 -0.024377 -0.223690 -0.227883 -0.183439 -0.205108 -0.156956 0.078924 0.100230 0.127811 0.197719 0.089234 0.080095 0.092073 0.174449 0.101608 0.087726 0.161909 0.086679 0.090063 0.076936 0.164791 0.164335
qa: -0.0002 0.0394 -0.5141 -0.2312 -0.4057 -0.1970 -0.0973 0.1507 -0.1325 -0.1247 0.3297 0.2326 0.3753 -0.0092 -0.2689 -0.0244 -0.2237 -0.2279 -0.1834 -0.2051 -0.1570 0.0789 0.1002 0.1278 0.1977 0.0892 0.0801 0.0921 0.1744 0.1016 0.0877 0.1619 0.0867 0.0901 0.0769 0.1648 0.1643
va: 2.6849 2.7646 2.0096 3.2175 3.0005 3.1895 3.1094 3.8629 3.6853 3.8755 3.6807 4.2058 4.1764 3.7328 3.9513 3.8869 3.9679 3.9056 3.9734 4.0735 4.0014 1.0192 0.9941 1.0583 0.9954 1.0043 1.0146 1.0043 1.0159 0.9984 1.0018 1.0001 1.0053 1.0091 1.0128 0.9932 0.9944
dispcorr: -0.016456871 hartree
energy: -1633.871270121302
dipole: -20.00786 18.27427 -1.73359 -7.91168 6.54719 -1.36449 6.94323 -5.53796 1.40528
magnitude: 2.61571 au
magnitude: 6.64862 debye
