program: Gaussian 09
title: 000066041
version: EM64L-G09RevD.01
frameworkgroup: C1[X(C10H10)]
method: RPBEPBE
basis: SDD
operation: Freq
keyword: #p
keyword: freq=noraman
keyword: PBEPBE/SDD
title: #p freq=noraman PBEPBE/SDD
converged: YES YES NO NO
title: Mulliken charges:
elementType: C C C C C C C C C C H H H H H H H H H H
charge: 0.481113 0.481113 -0.403730 -0.397689 -0.397690 -0.403731 -0.198920 -0.198920 -0.573681 -0.573680 0.225725 0.223790 0.223790 0.225725 0.214783 0.214783 0.215889 0.212721 0.215888 0.212721
chargesum: 0.00000
title: Mulliken charges with hydrogens summed into heavy atoms:
elementType: C C C C C C C C C C
charge: 0.481113 0.481113 -0.178005 -0.173899 -0.173900 -0.178006 0.015863 0.015863 -0.145071 -0.145071
polarizability: 2.22883771e+02 -1.25892288e+01 1.03025308e+02 -3.12371154e-03 1.22893938e-02 4.26262115e+01
1716.lowfreq: -12.8832 -0.0005 0.0004 0.0005 4.4675 15.3890 52.4367 87.6896 149.8744
frequency: 52.4366 87.6845 149.8744 171.2388 251.0780 294.5296 392.3118 406.2783 451.2352 465.7847 550.2626 622.4814 637.1437 678.0214 699.8166 785.0258 809.7618 842.1115 863.9219 929.3146 930.0052 966.5411 976.2796 1005.4694 1007.9345 1010.8659 1029.2242 1032.4849 1133.2065 1192.5446 1222.6730 1226.0271 1290.8276 1299.6604 1334.8906 1371.4013 1419.4027 1432.2674 1438.7297 1509.4894 1563.7063 1616.2836 1639.3161 1644.0177 3086.8127 3087.1702 3103.5557 3103.6122 3118.2943 3118.5333 3145.3833 3150.1608 3204.9881 3205.0629
redmass: 3.2554 2.4087 1.9992 3.3672 3.2332 2.3003 4.8492 2.6639 2.1193 3.2374 2.8052 1.8651 6.8698 1.4494 3.1456 2.6991 4.4423 1.2633 1.7873 1.3542 1.3506 1.3911 1.3812 2.9181 1.1688 1.1841 1.4996 1.5575 1.4324 1.2924 1.8339 2.4783 1.3753 1.4524 1.2494 3.3082 3.3666 1.2790 1.2957 2.5289 5.6697 5.9435 4.4121 4.4045 1.0807 1.0804 1.0708 1.0713 1.0878 1.0872 1.0949 1.0962 1.1140 1.1140
irintensity: 0.0298 0.0000 1.7233 0.4354 0.0000 0.0000 0.0001 1.4800 25.6257 3.7800 0.0001 0.0001 0.0000 1.0751 1.4009 0.0002 0.0000 0.0000 61.8517 0.0010 173.3483 0.0001 1.3502 5.0241 43.3520 0.0001 18.2006 0.0003 9.3365 0.0000 8.7944 0.0000 0.0000 2.7290 0.0000 23.1744 8.6875 0.0000 9.3939 18.8900 0.0000 0.0000 0.0001 36.2471 46.4055 0.0026 9.4274 0.0113 29.6669 0.0000 37.2074 0.0000 47.2139 0.0129
temp: 298.150 k
press: 1.00000 atm
elementType: 6 6 6 6 6 6 6 6 6 6 1 1 1 1 1 1 1 1 1 1
symmnumber: 1
zpe: 429203.0 jmol-1
zpe.correction: 0.163475 hartree
zpe.thermalcorrener: 0.172690 hartree
zpe.thermalcorrenthalpy: 0.173635 hartree
zpe.thermalcorrgfe: 0.128879 hartree
zpe.sumelectzpe: -386.320822 hartree
zpe.sumelectthermal: -386.311606 hartree
zpe.sumelectthermalent: -386.310662 hartree
zpe.sumelectthermalfe: -386.355417 hartree
dipole: 0.0000 0.0000 -0.0021
dipole: 0.0021
quadrupole: -53.0595 -51.0497 -66.7795
quadrupole: 0.3056 0.0001 0.0033
quadrupole: 3.9034 5.9132 -9.8166 0.3056 0.0001 0.0033
hfenergy: -386.4842964 hartree
pointgroup: C01 [X(C10H10)]
dipole: 0.0000015 -0.0000004 0.0008233 debye
dipolederiv: 0.0843318 0.0216123 0.0001434 0.1557525 -0.0557205 -0.0003038 0.0009759 -0.0001517 0.0554995 0.0843302 0.0216128 -0.0001314 0.155753 -0.0557211 0.0002521 -0.0008559 0.0001033 0.0554996 -0.1354499 -0.0813479 -0.000029 -0.1259824 0.0984215 0.0000443 0.0000763 -0.0000019 -0.1770312 -0.0377015 0.0826709 -0.0000017 0.1386048 0.0257728 0.0000619 -0.0000026 -0.0001656 -0.1504946 -0.0377014 0.0826709 0.000014 0.1386063 0.0257726 -0.000013 0.0000097 0.000219 -0.1504949 -0.1354494 -0.0813482 -0.0000108 -0.1259831 0.0984218 0.0000526 -0.0001093 0.0000981 -0.1770314 0.3978243 -0.0118113 0.000207 -0.2308176 0.1602574 0.0008667 -0.0005705 0.0008187 -0.14441 0.397827 -0.0118113 -0.00021 -0.230817 0.1602577 -0.0007081 0.000408 -0.0006755 -0.144411 -0.3413824 -0.0969073 -0.0002329 -0.1411682 0.0399285 0.000845 -0.0014061 0.0005747 -0.4127477 -0.3413823 -0.096908 0.0001889 -0.1411708 0.0399284 -0.0006027 0.0013405 -0.0003396 -0.4127479 0.0352875 0.0928723 0.0000466 0.0818938 -0.083759 -0.0000109 0.0000367 0.0000072 0.1529077 -0.0011727 -0.1133856 -0.0000264 -0.085711 -0.0240724 -0.0000256 0.0000102 0.0000665 0.1462565 -0.0011726 -0.1133848 -0.0000025 -0.0857111 -0.0240727 -0.0000263 -0.0000273 -0.0001215 0.1462568 0.0352874 0.0928722 -0.0000081 0.0818939 -0.0837593 -0.0000721 0.0000032 -0.0000896 0.1529077 0.0260865 -0.0061206 -0.0000222 0.1117747 -0.1242413 -0.0007087 0.0002259 -0.0006908 0.1523658 0.0260857 -0.0061198 0.0000233 0.1117755 -0.1242416 0.000569 -0.0001709 0.0005605 0.1523665 -0.1167459 0.043133 0.0000521 0.0555221 0.0680683 -0.0002376 0.0005965 -0.0001495 0.1899017 0.0889222 0.0692838 0.0000988 0.0401308 -0.1046547 -0.0005431 0.0003815 -0.0003758 0.1877524 -0.1167466 0.0431325 -0.0000333 0.055522 0.0680683 0.0001737 -0.0005626 0.00009 0.1899017 0.0889222 0.0692843 -0.0000662 0.0401319 -0.1046546 0.0003866 -0.0003591 0.0002234 0.1877527 unknown
polarizability: 222.5094367|14.255372|103.3996413|0.0029521|0.0123318|42.6262115 unknown
InChI: InChI=1S/C10H10/c1-3-9-5-7-10(4-2)8-6-9/h3-8H,1-2H2
charge 0 multiplicity 1
20 atoms
C  -1.424579 0.216964 -0.052537
C  1.424579 -0.216759 -0.052671
C  -0.506117 1.307461 -0.052413
C  0.883811 1.100086 -0.052585
C  -0.883813 -1.099879 -0.052928
C  0.506117 -1.307255 -0.052892
C  -2.872815 0.503903 -0.052787
C  2.872817 -0.503693 -0.053061
C  -3.896059 -0.396134 -0.055451
C  3.896057 0.39635 -0.055249
H  -0.900212 2.331642 -0.052432
H  1.555256 1.965698 -0.052745
H  -1.555255 -1.965493 -0.053344
H  0.900212 -2.331436 -0.053279
H  -3.132033 1.57331 -0.049992
H  3.132039 -1.573101 -0.0508
H  -4.939072 -0.063729 -0.054892
H  -3.731159 -1.479886 -0.057235
H  4.939071 0.063948 -0.054842
H  3.731154 1.480103 -0.056464
