program: Orca
programVersion: 5.0.2
elementType: S S O N N N N C C C C C C C C C C C C C C H H H H H H H H H H H H H H H H
charge: 0
multiplicity: 1
keywords: wb97x-d3
keywords: def2-TZVPP
keywords: def2/J RIJCOSX
keywords: DEFGRID2
keywords: scfconv7
keywords: smallprint printgap noloewdin
keywords: NOSOSCF
formula: C14H16N4OS2
InChI: InChI=1/C14H16N4OS2/c1-3-9-12(21-14(18-9)16-4-2)13(19)17-10(8-15)11-6-5-7-20-11/h5-7,10,16-17H,3-4H2,1-2H3
37 atoms
S  -2.593639 -0.249492 -1.275655
S  3.508079 -0.407718 1.620127
O  0.182585 -0.850062 -2.008281
N  1.196239 0.401469 -0.419472
N  -2.870892 0.365574 1.20942
N  -4.886104 0.163231 0.05655
N  3.626801 2.553436 -1.38573
C  -1.535866 0.298054 0.98705
C  -1.167115 0.006008 -0.302875
C  -0.641045 0.525272 2.165039
C  2.522242 0.22053 -0.949597
C  -3.555201 0.123663 0.118307
C  0.109076 -0.19397 -0.977267
C  3.427719 -0.616086 -0.087739
C  -0.446045 2.007692 2.475513
C  -5.658966 -0.235176 -1.100418
C  4.304829 -1.566775 -0.511013
C  -7.110555 0.159942 -0.930526
C  5.048526 -2.139882 0.555295
C  3.13388 1.532417 -1.198257
C  4.718279 -1.610486 1.763283
H  -1.103357 0.039076 3.026033
H  0.322023 0.034762 2.023345
H  2.438706 -0.274709 -1.921127
H  1.068082 1.093513 0.301125
H  0.026223 2.541524 1.648781
H  0.186412 2.132092 3.354476
H  -1.399507 2.49595 2.678078
H  -5.365925 0.275841 0.938348
H  -5.252811 0.256445 -1.988985
H  -5.57999 -1.314944 -1.265103
H  4.414241 -1.848506 -1.54947
H  -7.217305 1.239108 -0.823116
H  -7.68337 -0.150228 -1.803186
H  -7.554341 -0.31839 -0.056526
H  5.788865 -2.916455 0.427361
H  5.114695 -1.867487 2.734326
elementType: S O N C H
totalener: -1633.85647158 hartree
nucrepener: 1874.60271559 hartree
electener: -3508.45918718 hartree
oneelecener: -5962.94548470 hartree
twoeener: 2454.48629753 hartree
cpcmener: -0.03736816 hartree
kineticenergy: 1628.86552443 hartree
xcener: -119.649070388852 hartree
chargesum: 0.0000000
charge: 0.003791 0.038295 -0.512019 -0.246651 -0.397399 -0.183100 -0.095367 0.096077 -0.097765 -0.124948 0.320521 0.222046 0.379327 0.002526 -0.254795 -0.011169 -0.231785 -0.266131 -0.179603 -0.199921 -0.159033 0.083369 0.071060 0.129033 0.213999 0.083511 0.096278 0.091517 0.168885 0.092651 0.104756 0.162344 0.091741 0.089700 0.088857 0.165001 0.164400
qa: 0.0038 0.0383 -0.5120 -0.2467 -0.3974 -0.1831 -0.0954 0.0961 -0.0978 -0.1249 0.3205 0.2220 0.3793 0.0025 -0.2548 -0.0112 -0.2318 -0.2661 -0.1796 -0.1999 -0.1590 0.0834 0.0711 0.1290 0.2140 0.0835 0.0963 0.0915 0.1689 0.0927 0.1048 0.1623 0.0917 0.0897 0.0889 0.1650 0.1644
va: 2.6925 2.7672 2.0107 3.2119 3.0113 3.1832 3.1085 3.9491 3.6397 3.9023 3.6902 4.2211 4.1639 3.7105 3.9029 3.8568 3.9727 3.9658 3.9717 4.0674 4.0038 1.0238 1.0319 1.0542 0.9859 1.0064 1.0052 1.0109 1.0192 0.9910 0.9920 1.0002 1.0035 1.0060 0.9994 0.9933 0.9948
dispcorr: -0.016615564 hartree
energy: -1633.873087146295
dipole: -20.81726 19.01524 -1.80202 1.46445 -2.43317 -0.96872 7.05213 -5.57111 1.48102
magnitude: 2.52569 au
magnitude: 6.41979 debye
