program: Orca
programVersion: 5.0.2
elementType: S S O N N N N C C C C C C C C C C C C C C H H H H H H H H H H H H H H H H
charge: 0
multiplicity: 1
keywords: wb97x-d3
keywords: def2-TZVPP
keywords: def2/J RIJCOSX
keywords: DEFGRID2
keywords: scfconv7
keywords: smallprint printgap noloewdin
keywords: NOSOSCF
formula: C14H16N4OS2
InChI: InChI=1/C14H16N4OS2/c1-3-9-12(21-14(18-9)16-4-2)13(19)17-10(8-15)11-6-5-7-20-11/h5-7,10,16-17H,3-4H2,1-2H3
37 atoms
S  -2.716408 0.17867 -1.15321
S  3.509051 -2.09934 0.534753
O  -0.05584 -0.301624 -2.171746
N  1.151458 0.114911 -0.313657
N  -2.894052 0.151994 1.416642
N  -4.950502 0.305328 0.338407
N  3.102049 2.19831 -2.173278
C  -1.573727 0.045479 1.13254
C  -1.25517 0.058786 -0.203811
C  -0.641697 -0.075327 2.297588
C  2.416731 -0.034873 -0.986273
C  -3.620264 0.228098 0.326924
C  -0.025153 -0.055369 -0.971079
C  3.477277 -0.4690 -0.017572
C  -0.288248 1.284286 2.897993
C  -5.781538 0.471723 -0.834089
C  4.439615 0.278175 0.59093
C  -5.896014 1.911811 -1.306409
C  5.217724 -0.47649 1.509605
C  2.812287 1.215056 -1.654902
C  4.823216 -1.775537 1.582239
H  -1.141351 -0.680622 3.056013
H  0.262888 -0.619897 2.025164
H  2.301655 -0.780493 -1.77839
H  1.176732 0.573057 0.583847
H  0.230937 1.925063 2.182801
H  0.361474 1.159578 3.764502
H  -1.183748 1.813447 3.224831
H  -5.378137 0.386852 1.24899
H  -5.399492 -0.167565 -1.634829
H  -6.76718 0.080306 -0.586027
H  4.594499 1.330927 0.395853
H  -4.925735 2.332458 -1.573258
H  -6.533525 1.964475 -2.189687
H  -6.338772 2.542758 -0.535092
H  6.031857 -0.066531 2.089745
H  5.236483 -2.563228 2.194927
elementType: S O N C H
totalener: -1633.85791762 hartree
nucrepener: 1880.46076075 hartree
electener: -3514.31867838 hartree
oneelecener: -5974.73876074 hartree
twoeener: 2460.42008237 hartree
cpcmener: -0.03833130 hartree
kineticenergy: 1628.86543888 hartree
xcener: -119.648902576250 hartree
chargesum: 0.0000000
charge: 0.002447 0.054412 -0.521681 -0.223524 -0.394073 -0.195849 -0.094273 0.092661 -0.085696 -0.123699 0.357060 0.230353 0.390244 -0.092022 -0.256697 -0.022951 -0.159422 -0.228543 -0.210808 -0.231586 -0.153588 0.083595 0.071353 0.130391 0.206756 0.082676 0.097007 0.091125 0.174296 0.086775 0.102004 0.154886 0.076850 0.090208 0.086977 0.166421 0.165915
qa: 0.0024 0.0544 -0.5217 -0.2235 -0.3941 -0.1958 -0.0943 0.0927 -0.0857 -0.1237 0.3571 0.2304 0.3902 -0.0920 -0.2567 -0.0230 -0.1594 -0.2285 -0.2108 -0.2316 -0.1536 0.0836 0.0714 0.1304 0.2068 0.0827 0.0970 0.0911 0.1743 0.0868 0.1020 0.1549 0.0768 0.0902 0.0870 0.1664 0.1659
va: 2.6870 2.7580 1.9959 3.2181 3.0075 3.1952 3.1125 3.9568 3.6343 3.9076 3.7288 4.2089 4.1438 3.8185 3.9035 3.8857 3.9076 3.9074 4.0002 4.0814 3.9871 1.0220 1.0231 1.0334 0.9929 1.0069 1.0046 1.0098 1.0162 1.0022 0.9983 1.0090 1.0125 1.0091 1.0052 0.9939 0.9929
dispcorr: -0.016928543 hartree
energy: -1633.874846167411
dipole: -16.71145 15.39880 -1.31265 8.11726 -8.74720 -0.62995 11.67293 -8.94689 2.72604
magnitude: 3.09049 au
magnitude: 7.85541 debye
