program: Orca
programVersion: 5.0.2
elementType: S S O N N N N C C C C C C C C C C C C C C H H H H H H H H H H H H H H H H
charge: 0
multiplicity: 1
keywords: wb97x-d3
keywords: def2-TZVPP
keywords: def2/J RIJCOSX
keywords: DEFGRID2
keywords: scfconv7
keywords: smallprint printgap noloewdin
keywords: NOSOSCF
formula: C14H16N4OS2
InChI: InChI=1/C14H16N4OS2/c1-3-9-12(21-14(18-9)16-4-2)13(19)17-10(8-15)11-6-5-7-20-11/h5-7,10,16-17H,3-4H2,1-2H3
37 atoms
S  -2.046583 -1.102668 1.442309
S  3.482004 1.555469 -0.11512
O  0.648879 -1.900298 0.94336
N  1.147464 -0.653598 -0.865618
N  -3.138249 0.323342 -0.402343
N  -4.575016 -0.189608 1.358398
N  3.546202 -1.040344 -3.209953
C  -1.8628 0.103071 -0.805281
C  -1.090043 -0.6344 0.057022
C  -1.455447 0.708668 -2.111374
C  2.542542 -1.015834 -0.79497
C  -3.387023 -0.240705 0.754591
C  0.284914 -1.108189 0.080873
C  3.363775 -0.147527 0.11602
C  -0.957382 2.143656 -1.945979
C  -5.682852 0.590165 0.838364
C  4.069026 -0.547956 1.209574
C  -5.556239 2.079907 1.107354
C  4.718752 0.530536 1.867217
C  3.09691 -1.026199 -2.152497
C  4.487213 1.724959 1.259668
H  -0.709241 0.094684 -2.617838
H  -2.33137 0.708994 -2.761842
H  2.616712 -2.04161 -0.423551
H  0.904762 0.142267 -1.434882
H  -0.706301 2.574149 -2.91548
H  -0.067728 2.200448 -1.315805
H  -1.723523 2.771395 -1.490159
H  -4.673892 -0.588373 2.278399
H  -5.772733 0.402925 -0.232124
H  -6.586085 0.197951 1.304452
H  4.122265 -1.578559 1.532799
H  -5.49148 2.28605 2.176495
H  -4.674862 2.499993 0.622649
H  -6.431057 2.603188 0.71865
H  5.326766 0.420581 2.75365
H  4.852239 2.699681 1.547598
elementType: S O N C H
totalener: -1633.85609688 hartree
nucrepener: 1892.24292533 hartree
electener: -3526.09902221 hartree
oneelecener: -5998.62644635 hartree
twoeener: 2472.52742414 hartree
cpcmener: -0.03720592 hartree
kineticenergy: 1628.87045062 hartree
xcener: -119.649163248326 hartree
chargesum: 0.0000000
charge: 0.018068 0.043816 -0.520155 -0.225581 -0.403393 -0.201907 -0.091211 0.081427 -0.084368 -0.128857 0.303704 0.249610 0.370911 -0.022833 -0.250659 0.016635 -0.218832 -0.254329 -0.185477 -0.206007 -0.156047 0.079308 0.085620 0.137458 0.201291 0.098175 0.073345 0.093395 0.170800 0.081171 0.098158 0.162164 0.081515 0.083612 0.090060 0.164586 0.164826
qa: 0.0181 0.0438 -0.5202 -0.2256 -0.4034 -0.2019 -0.0912 0.0814 -0.0844 -0.1289 0.3037 0.2496 0.3709 -0.0228 -0.2507 0.0166 -0.2188 -0.2543 -0.1855 -0.2060 -0.1560 0.0793 0.0856 0.1375 0.2013 0.0982 0.0733 0.0934 0.1708 0.0812 0.0982 0.1622 0.0815 0.0836 0.0901 0.1646 0.1648
va: 2.6722 2.7656 1.9974 3.2195 2.9664 3.2354 3.1088 3.9660 3.6384 3.9177 3.7809 4.1466 4.1493 3.6967 3.9113 3.8407 3.9700 3.9081 3.9794 4.0606 4.0010 1.0166 1.0218 1.0306 0.9975 1.0053 1.0101 1.0064 1.0091 1.0179 0.9979 1.0017 1.0072 1.0129 1.0077 0.9934 0.9943
dispcorr: -0.017236002 hartree
energy: -1633.873332880629
dipole: -21.17256 19.24261 -1.92995 13.65624 -12.22621 1.43003 -0.63125 2.09217 1.46093
magnitude: 2.81141 au
magnitude: 7.14603 debye
