program: Orca
programVersion: 5.0.2
elementType: S S O N N N N C C C C C C C C C C C C C C H H H H H H H H H H H H H H H H
charge: 0
multiplicity: 1
keywords: wb97x-d3
keywords: def2-TZVPP
keywords: def2/J RIJCOSX
keywords: DEFGRID2
keywords: scfconv7
keywords: smallprint printgap noloewdin
keywords: NOSOSCF
formula: C14H16N4OS2
InChI: InChI=1/C14H16N4OS2/c1-3-9-12(21-14(18-9)16-4-2)13(19)17-10(8-15)11-6-5-7-20-11/h5-7,10,16-17H,3-4H2,1-2H3
37 atoms
S  -2.505766 -1.518196 -0.723284
S  2.963754 -0.386705 1.76237
O  0.2769 -2.086859 -1.114788
N  1.182862 -0.087338 -0.569296
N  -2.996585 0.589829 0.670551
N  -4.902385 -0.628177 0.107442
N  3.301164 1.16894 -2.891504
C  -1.650864 0.554353 0.508807
C  -1.174694 -0.495253 -0.237095
C  -0.868993 1.658431 1.148448
C  2.507581 -0.449432 -0.994267
C  -3.584784 -0.421933 0.081253
C  0.136404 -0.954191 -0.670706
C  3.508341 -0.427025 0.133455
C  -0.819024 2.909248 0.272751
C  -5.831797 0.335532 0.667173
C  4.86608 -0.485739 0.059598
C  -6.093643 1.522534 -0.243601
C  5.478366 -0.494588 1.341331
C  2.954513 0.447873 -2.066877
C  4.569965 -0.441474 2.352474
H  -1.358793 1.902833 2.0925
H  0.137627 1.331118 1.410515
H  2.459433 -1.456552 -1.419228
H  1.014022 0.888191 -0.377764
H  -1.823224 3.278509 0.063074
H  -0.330988 2.719571 -0.684884
H  -0.268259 3.704286 0.775458
H  -5.288199 -1.384579 -0.434612
H  -6.758768 -0.202096 0.863097
H  -5.451467 0.67165 1.631844
H  5.413832 -0.523609 -0.872704
H  -5.182985 2.093099 -0.426364
H  -6.496884 1.201991 -1.204879
H  -6.82082 2.192882 0.216597
H  6.546842 -0.534767 1.498215
H  4.759434 -0.426857 3.415188
elementType: S O N C H
totalener: -1633.85540539 hartree
nucrepener: 1888.38178008 hartree
electener: -3522.23718547 hartree
oneelecener: -5990.60382331 hartree
twoeener: 2468.36663784 hartree
cpcmener: -0.03630994 hartree
kineticenergy: 1628.86565091 hartree
xcener: -119.651012933674 hartree
chargesum: -0.0000000
charge: 0.017817 0.052409 -0.506973 -0.280406 -0.404296 -0.203067 -0.095198 0.075246 -0.093570 -0.121889 0.389390 0.246252 0.382341 0.003748 -0.254595 0.017656 -0.279612 -0.255763 -0.166841 -0.214737 -0.181211 0.085657 0.069943 0.133064 0.216610 0.093000 0.081913 0.097206 0.170337 0.098351 0.081097 0.162840 0.084106 0.082082 0.090497 0.165527 0.161071
qa: 0.0178 0.0524 -0.5070 -0.2804 -0.4043 -0.2031 -0.0952 0.0752 -0.0936 -0.1219 0.3894 0.2463 0.3823 0.0037 -0.2546 0.0177 -0.2796 -0.2558 -0.1668 -0.2147 -0.1812 0.0857 0.0699 0.1331 0.2166 0.0930 0.0819 0.0972 0.1703 0.0984 0.0811 0.1628 0.0841 0.0821 0.0905 0.1655 0.1611
va: 2.6717 2.7957 2.0165 3.1973 2.9656 3.2358 3.1076 3.9696 3.6304 3.9249 3.6305 4.1528 4.1302 3.8082 3.9096 3.8412 4.0005 3.9124 3.9597 4.0491 4.0082 1.0230 1.0195 1.0427 0.9897 1.0069 1.0077 1.0051 1.0092 0.9981 1.0181 1.0044 1.0116 1.0071 1.0076 0.9930 0.9970
dispcorr: -0.017226152 hartree
energy: -1633.872631542481
dipole: -18.26018 16.61582 -1.64437 15.70579 -15.17024 0.53555 5.48325 -3.81012 1.67312
magnitude: 2.40626 au
magnitude: 6.11623 debye
