program: Orca
programVersion: 5.0.2
elementType: S S O N N N N C C C C C C C C C C C C C C H H H H H H H H H H H H H H H H
charge: 0
multiplicity: 1
keywords: wb97x-d3
keywords: def2-TZVPP
keywords: def2/J RIJCOSX
keywords: DEFGRID2
keywords: scfconv7
keywords: smallprint printgap noloewdin
keywords: NOSOSCF
formula: C14H16N4OS2
InChI: InChI=1/C14H16N4OS2/c1-3-9-12(21-14(18-9)16-4-2)13(19)17-10(8-15)11-6-5-7-20-11/h5-7,10,16-17H,3-4H2,1-2H3
37 atoms
S  -2.361851 0.133185 1.327988
S  3.724208 1.031216 -0.961197
O  0.289422 -0.845377 1.681495
N  1.052404 -0.840977 -0.439764
N  -3.132337 0.400545 -1.113852
N  -4.764701 0.963058 0.444302
N  3.321456 -2.876846 -1.884076
C  -1.846208 -0.01743 -1.173408
C  -1.231142 -0.209524 0.040387
C  -1.256339 -0.187993 -2.53865
C  2.371282 -1.271322 -0.049381
C  -3.542581 0.532749 0.125823
C  0.080556 -0.649605 0.488721
C  3.342912 -0.158994 0.225322
C  -0.605022 1.096941 -3.048209
C  -5.32188 0.950992 1.779676
C  4.030835 0.055844 1.379711
C  -5.880808 -0.39937 2.197133
C  4.874647 1.196356 1.310939
C  2.894315 -2.178084 -1.07811
C  4.807034 1.820588 0.104972
H  -0.548377 -1.01796 -2.565688
H  -2.066087 -0.469511 -3.213252
H  2.283846 -1.860055 0.8678
H  0.924176 -0.525159 -1.387717
H  -1.329157 1.911222 -3.084238
H  -0.214428 0.952207 -4.055623
H  0.222234 1.420351 -2.414003
H  -5.404139 1.061939 -0.330714
H  -4.559636 1.289088 2.486064
H  -6.107249 1.705599 1.806715
H  3.936698 -0.581105 2.248429
H  -5.115007 -1.176012 2.19224
H  -6.287007 -0.33934 3.207409
H  -6.685629 -0.712287 1.531179
H  5.501312 1.535683 2.123032
H  5.334587 2.706857 -0.215258
elementType: S O N C H
totalener: -1633.85639160 hartree
nucrepener: 1886.59949492 hartree
electener: -3520.45588652 hartree
oneelecener: -5987.23543317 hartree
twoeener: 2466.77954666 hartree
cpcmener: -0.03740829 hartree
kineticenergy: 1628.86911242 hartree
xcener: -119.649835705199 hartree
chargesum: -0.0000000
charge: 0.005819 0.042339 -0.523269 -0.224034 -0.388182 -0.200022 -0.092663 0.089759 -0.092649 -0.126778 0.296295 0.232288 0.383915 -0.015708 -0.250305 -0.018215 -0.217952 -0.228507 -0.186966 -0.199991 -0.157296 0.076762 0.085654 0.135087 0.203231 0.093139 0.098364 0.072522 0.173637 0.085515 0.100720 0.162665 0.077495 0.089868 0.087459 0.165134 0.164870
qa: 0.0058 0.0423 -0.5233 -0.2240 -0.3882 -0.2000 -0.0927 0.0898 -0.0926 -0.1268 0.2963 0.2323 0.3839 -0.0157 -0.2503 -0.0182 -0.2180 -0.2285 -0.1870 -0.2000 -0.1573 0.0768 0.0857 0.1351 0.2032 0.0931 0.0984 0.0725 0.1736 0.0855 0.1007 0.1627 0.0775 0.0899 0.0875 0.1651 0.1649
va: 2.6934 2.7641 1.9955 3.2230 3.0083 3.1978 3.1074 3.9712 3.6111 3.9157 3.7629 4.2036 4.1716 3.7022 3.9084 3.8943 3.9701 3.9131 3.9799 4.0661 4.0012 1.0155 1.0235 1.0360 0.9965 1.0078 1.0050 1.0115 1.0160 1.0013 0.9989 1.0009 1.0110 1.0094 1.0045 0.9935 0.9945
dispcorr: -0.016940058 hartree
energy: -1633.873331654423
dipole: -19.45469 17.64414 -1.81055 5.30165 -3.49684 1.80481 -0.43337 0.74926 0.31589
magnitude: 2.57589 au
magnitude: 6.54739 debye
