program: Orca
programVersion: 5.0.2
elementType: S S O N N N N C C C C C C C C C C C C C C H H H H H H H H H H H H H H H H
charge: 0
multiplicity: 1
keywords: wb97x-d3
keywords: def2-TZVPP
keywords: def2/J RIJCOSX
keywords: DEFGRID2
keywords: scfconv7
keywords: smallprint printgap noloewdin
keywords: NOSOSCF
formula: C14H16N4OS2
InChI: InChI=1/C14H16N4OS2/c1-3-9-12(21-14(18-9)16-4-2)13(19)17-10(8-15)11-6-5-7-20-11/h5-7,10,16-17H,3-4H2,1-2H3
37 atoms
S  -2.684432 -0.190909 -1.175151
S  2.930033 -1.81442 0.862857
O  0.000003 -0.537011 -2.108761
N  1.154944 0.269828 -0.340191
N  -2.91286 0.157692 1.366439
N  -4.951225 -0.039087 0.258193
N  3.286267 2.589399 -1.613496
C  -1.582645 0.134764 1.111594
C  -1.238648 -0.022325 -0.209358
C  -0.668678 0.280503 2.287996
C  2.430729 0.193166 -0.998283
C  -3.61932 0.001903 0.271871
C  0.004679 -0.120184 -0.956935
C  3.451358 -0.536606 -0.166745
C  -0.465164 1.74173 2.684344
C  -5.760883 -0.102585 -0.93966
C  4.805702 -0.406322 -0.15422
C  -5.934156 1.236832 -1.636978
C  5.434451 -1.3518 0.701056
C  2.916059 1.536109 -1.343239
C  4.542921 -2.175966 1.312541
H  -1.121182 -0.256924 3.123118
H  0.291002 -0.203635 2.105231
H  2.283428 -0.338139 -1.943683
H  1.117082 0.801611 0.51578
H  0.004147 2.318819 1.885562
H  0.173133 1.811667 3.56517
H  -1.415859 2.219419 2.922036
H  -5.407101 0.146163 1.139391
H  -5.329538 -0.839624 -1.62284
H  -6.731897 -0.499789 -0.647647
H  5.344532 0.333316 -0.731084
H  -4.980252 1.663173 -1.949248
H  -6.54835 1.11332 -2.529645
H  -6.430347 1.95665 -0.985376
H  6.502766 -1.408298 0.853249
H  4.744857 -2.970785 2.014846
elementType: S O N C H
totalener: -1633.85641730 hartree
nucrepener: 1889.34527180 hartree
electener: -3523.20168910 hartree
oneelecener: -5992.48132973 hartree
twoeener: 2469.27964063 hartree
cpcmener: -0.03644398 hartree
kineticenergy: 1628.86405900 hartree
xcener: -119.650971446180 hartree
chargesum: -0.0000000
charge: 0.002610 0.050866 -0.509867 -0.270596 -0.393348 -0.196652 -0.093490 0.086013 -0.091748 -0.118094 0.382490 0.231222 0.397710 -0.020282 -0.255405 -0.022904 -0.254506 -0.229421 -0.172823 -0.221116 -0.174991 0.084151 0.064782 0.137970 0.212108 0.082911 0.097008 0.091709 0.174127 0.087585 0.101964 0.157294 0.076951 0.090026 0.087115 0.165904 0.162726
qa: 0.0026 0.0509 -0.5099 -0.2706 -0.3933 -0.1967 -0.0935 0.0860 -0.0917 -0.1181 0.3825 0.2312 0.3977 -0.0203 -0.2554 -0.0229 -0.2545 -0.2294 -0.1728 -0.2211 -0.1750 0.0842 0.0648 0.1380 0.2121 0.0829 0.0970 0.0917 0.1741 0.0876 0.1020 0.1573 0.0770 0.0900 0.0871 0.1659 0.1627
va: 2.6893 2.7805 2.0120 3.2095 3.0072 3.1959 3.1101 3.9684 3.6004 3.9153 3.6481 4.2084 4.1426 3.8330 3.9039 3.8853 3.9817 3.9050 3.9679 4.0652 4.0033 1.0232 1.0250 1.0385 0.9922 1.0069 1.0046 1.0100 1.0162 1.0014 0.9985 1.0085 1.0137 1.0090 1.0053 0.9926 0.9954
dispcorr: -0.016994648 hartree
energy: -1633.873411949957
dipole: -16.17283 14.65801 -1.51482 6.50457 -7.26290 -0.75833 8.00889 -6.12920 1.87969
magnitude: 2.53041 au
magnitude: 6.43180 debye
