program: Gaussian 09
title: 000066039
version: EM64L-G09RevD.01
frameworkgroup: C1[X(C8H13ClO)]
method: RPBEPBE
basis: SDD
operation: Freq
keyword: #p
keyword: freq=noraman
keyword: PBEPBE/SDD
title: #p freq=noraman PBEPBE/SDD
converged: NO YES NO NO
title: Mulliken charges:
elementType: Cl O C C C C C C C C H H H H H H H H H H H H H
charge: -0.110602 -0.089671 0.006725 -0.487953 -0.487073 -0.430434 -0.426679 -0.435976 -0.401025 -0.047026 0.206714 0.197140 0.226853 0.227883 0.198789 0.210918 0.217411 0.219861 0.208227 0.218308 0.229276 0.281320 0.267012
chargesum: 0.00000
title: Mulliken charges with hydrogens summed into heavy atoms:
elementType: Cl O C C C C C C C C
charge: -0.110602 -0.089671 0.213439 -0.063959 -0.060401 -0.002105 0.001409 0.011608 0.147307 -0.047026
polarizability: 1.22362337e+02 -7.99000063e+00 9.48034694e+01 -9.37641820e-01 3.45747347e+00 7.05664316e+01
1716.lowfreq: -38.4032 -20.3802 -6.5682 -4.3870 0.0016 0.0020 0.0022 28.8860 51.4977
frequency: -38.2061 27.6902 51.4535 73.9589 106.3585 166.1374 214.5017 233.8785 382.8619 390.4253 435.5999 467.7320 539.2969 619.6596 705.0094 752.0678 764.3101 809.5856 858.9448 889.0444 923.7990 937.8805 961.9820 972.5920 1005.3653 1046.8046 1063.6272 1095.2737 1111.1344 1136.9392 1177.5285 1188.5164 1217.8915 1224.0220 1254.3909 1265.2131 1279.4632 1293.9278 1298.8244 1301.7126 1311.8884 1341.8433 1355.0622 1425.2766 1462.6761 1464.4800 1472.1642 1475.2777 1491.4197 1760.1936 2947.7533 2974.5315 2980.6266 2986.0447 2995.7802 2996.7486 3013.0545 3031.7273 3038.6933 3050.6433 3056.2555 3058.4822 3080.1190
redmass: 1.5910 4.7703 3.8626 4.4435 2.1618 2.5554 4.6992 4.4195 4.4849 4.4393 2.5366 2.7364 3.1613 2.7298 3.1515 1.5575 1.2800 1.5541 3.1766 2.4680 1.7865 3.4007 1.6275 1.6470 1.5290 2.9557 2.8290 2.1188 2.6253 1.3030 1.4797 1.3587 1.3208 1.2958 1.2465 1.2005 1.2959 1.2075 1.3130 1.3206 1.3870 1.4815 1.6614 1.0759 1.0851 1.0817 1.0839 1.0830 1.1003 10.9221 1.0827 1.0621 1.0619 1.0613 1.0606 1.0615 1.0661 1.0985 1.0983 1.0990 1.1035 1.1018 1.1047
irintensity: 0.0280 0.0801 2.9675 1.3960 2.3412 0.6264 6.0519 2.4255 18.7744 7.4253 14.6394 0.2389 22.3243 0.8331 107.7145 27.5608 9.5806 2.8709 10.3020 5.0852 4.1984 58.2927 40.3598 12.6107 1.3703 10.0146 3.4016 1.5942 4.3046 2.7296 1.3327 6.2952 5.2325 2.1898 19.9325 0.9648 6.4087 3.8910 3.1584 0.6254 3.0659 9.8468 0.3166 31.7198 2.1459 3.7216 11.2230 15.9199 2.1755 239.3877 12.5083 31.3013 15.5810 51.4198 15.3130 30.8697 54.2410 6.8699 38.5790 6.5099 6.7945 31.7716 109.8587
temp: 298.150 k
press: 1.00000 atm
elementType: 17 8 6 6 6 6 6 6 6 6 1 1 1 1 1 1 1 1 1 1 1 1 1
symmnumber: 1
zpe: 508509.5 jmol-1
zpe.correction: 0.193681 hartree
zpe.thermalcorrener: 0.203955 hartree
zpe.thermalcorrenthalpy: 0.204899 hartree
zpe.thermalcorrgfe: 0.155538 hartree
zpe.sumelectzpe: -847.145599 hartree
zpe.sumelectthermal: -847.135325 hartree
zpe.sumelectthermalent: -847.134381 hartree
zpe.sumelectthermalfe: -847.183741 hartree
dipole: -3.9752 -0.8614 -0.5749
dipole: 4.1079
quadrupole: -82.3453 -71.4247 -66.3561
quadrupole: -2.1141 -1.2732 -1.2136
quadrupole: -8.9699 1.9507 7.0193 -2.1141 -1.2732 -1.2136
hfenergy: -847.3392798 hartree
pointgroup: C01 [X(C8H13Cl1O1)]
dipole: 1.588281 0.2238756 -0.1981119 debye
dipolederiv: -0.8428795 0.4151959 -0.1079812 0.5308437 -0.637279 0.131585 -0.1373052 0.1317052 -0.2094332 -0.5445264 -0.139155 0.0658239 0.1869106 -1.0267363 0.2786021 -0.0353489 0.3016383 -0.2983096 0.0433539 0.0137152 -0.0220634 0.1031337 0.0417108 -0.0181702 -0.0076185 0.0117797 0.1646556 -0.0569971 -0.0333188 0.0054781 -0.0146433 0.0151591 -0.0923091 -0.0092524 -0.0381436 0.121686 -0.0502835 0.0167523 -0.0140347 -0.0651324 0.0455986 0.0228181 -0.015689 -0.0574782 0.1579178 0.0327109 0.0162844 0.0240387 0.0110609 0.0568097 -0.0261076 0.0042004 -0.0557003 0.1354096 0.0139012 -0.0240828 0.0131917 0.0097428 0.010625 -0.0244543 -0.0177446 0.0015614 0.1530139 -0.006428 0.0151653 0.0033298 -0.1113708 0.0992526 0.0216083 0.0456335 0.0060376 0.1516244 -0.3152721 -0.0506895 0.04774 -0.1275839 -0.1367204 0.0844253 0.0876662 0.0808408 0.0915347 1.4994767 -0.2573232 0.0080201 -0.6811834 1.5954592 -0.4699798 0.1303483 -0.4911347 0.2981764 0.0333394 0.0052094 -0.0073969 -0.0095004 0.0089568 0.0615129 -0.0167429 0.0472199 -0.1800984 0.0232722 -0.0145585 0.0610237 -0.0308663 0.0521915 0.0716871 0.0726939 0.0090204 -0.1536128 -0.0036795 0.1163418 -0.0130918 0.1332088 -0.1237622 0.0192626 -0.0296498 0.0434703 0.0566431 0.0557028 -0.015323 -0.010503 -0.0007888 -0.1046608 -0.1115505 0.0010581 -0.142899 -0.0221779 0.0288059 -0.0390741 0.0495194 -0.0177899 0.0254228 0.0618122 0.0325096 0.1259494 -0.1274878 -0.0363459 -0.0587307 -0.0884169 -0.0379088 0.0220484 -0.0634059 -0.1210669 -0.1009321 -0.0816536 0.0267824 -0.0214477 0.0358664 -0.050451 -0.0643978 0.0879824 0.0825367 0.1352447 -0.0508323 0.0059693 -0.0000163 0.0719519 -0.0078636 0.0384967 -0.0016592 0.1432871 -0.0235882 -0.1353388 -0.1130938 0.0785314 -0.0829608 0.0672302 0.0169605 0.0416504 -0.1345426 0.059558 -0.0010736 0.0463015 0.0109104 -0.0189869 0.0328872 0.0528414 0.0382362 0.0098488 0.0615626 -0.1252573 0.0266205 -0.046321 -0.0236973 -0.0362623 -0.083227 -0.0888045 -0.0411264 -0.08908 0.0199623 0.0817412 0.0030655 0.0005975 0.055822 0.0005419 -0.0638152 -0.008618 -0.073425 0.0641623 0.0515278 0.0088692 0.0025519 0.060505 0.0947085 0.0390734 -0.0350773 0.0567928 -0.0295107 unknown
polarizability: 121.0853769|-9.6299538|95.6968235|2.2432292|-4.7017455|70.9500372 unknown
InChI: InChI=1S/C8H13ClO/c9-8(10)6-5-7-3-1-2-4-7/h7H,1-6H2
charge 0 multiplicity 1
23 atoms
Cl -4.114766 1.20834 -0.354727
O  -3.17229 -1.245728 0.433641
C  1.095171 -0.147091 -0.37068
C  1.586201 1.070289 0.460328
C  2.225788 -1.185025 -0.13856
C  3.128132 1.105626 0.242584
C  3.539062 -0.353277 -0.166065
C  -0.303696 -0.677972 0.006346
C  -1.414023 0.360012 -0.262659
C  -2.803093 -0.154948 0.022606
H  1.094643 0.136081 -1.446186
H  1.351977 0.889865 1.529355
H  1.10364 2.022208 0.172398
H  2.218401 -1.99872 -0.886256
H  2.085745 -1.651103 0.857584
H  3.655084 1.445474 1.151672
H  3.386911 1.817772 -0.562218
H  3.975714 -0.358091 -1.181565
H  4.301246 -0.774384 0.513141
H  -0.313527 -0.96107 1.07725
H  -0.520703 -1.601316 -0.564507
H  -1.272575 1.27568 0.343354
H  -1.400542 0.705378 -1.315635
