program: Gaussian 09
title: 000066038
version: EM64L-G09RevD.01
frameworkgroup: C1[X(C7H9NS)]
method: RPBEPBE
basis: SDD
operation: Freq
keyword: #pfreq=noraman
keyword: PBEPBE/SDD
title: #p freq=noraman PBEPBE/SDD
converged: YES YES NO NO
title: Mulliken charges:
elementType: S N C C C C C C C H H H H H H H H H
charge: 0.167035 -0.696105 -0.246020 0.495247 -0.198791 -0.198517 -0.395494 -0.395485 -0.841636 0.246116 0.246056 0.217241 0.217245 0.305610 0.305606 0.261292 0.261304 0.249298
chargesum: 0.00000
title: Mulliken charges with hydrogens summed into heavy atoms:
elementType: S N C C C C C C C
charge: 0.167035 -0.084889 -0.246020 0.495247 0.047324 0.047538 -0.178253 -0.178240 -0.069743
polarizability: 1.53040593e+02 -1.13235917e-02 8.94439294e+01 -6.52635203e-01 1.96091609e-02 5.81697943e+01
1716.lowfreq: -12.1701 -3.4075 -0.0016 -0.0012 0.0011 9.8303 32.3489 84.5067 136.3094
frequency: 32.2581 84.4940 136.3044 180.5961 239.2056 328.2696 362.6006 375.6108 378.1921 386.8429 414.1846 517.0838 618.0121 631.9868 639.3985 716.3743 814.2232 814.6470 825.9320 942.4615 956.8924 960.4268 984.1288 990.4752 1014.9849 1077.0035 1120.0061 1180.9541 1288.6480 1310.8740 1335.1313 1373.4502 1422.2984 1443.1572 1459.9811 1490.2194 1572.5450 1617.9521 1644.2716 3004.6378 3118.6971 3121.0287 3128.4610 3129.2868 3148.5622 3153.8244 3567.7127 3707.7405
redmass: 3.3996 3.8698 1.0326 3.7554 5.3272 4.3710 1.4220 5.5610 1.0722 2.6123 2.7126 2.4599 6.2323 6.9378 7.2474 3.1561 1.2567 5.2293 1.7922 1.3406 1.3545 1.1730 1.2902 3.7926 1.4427 2.8298 1.2191 1.1064 1.3342 2.7743 1.1327 4.7888 3.4206 1.0656 1.0553 2.9729 7.0271 4.3762 1.2586 1.0277 1.0884 1.0881 1.1061 1.1036 1.0954 1.0966 1.0449 1.1040
irintensity: 1.9493 2.4509 0.1232 2.0974 0.0314 10.2475 279.8300 37.4575 0.3002 2.2381 0.0053 25.6759 3.8460 0.0959 0.1130 0.1474 0.0005 1.0868 87.0155 0.2185 0.0257 5.3582 28.3987 2.8210 0.1064 0.3685 17.1506 24.8638 1.5824 65.7059 0.6822 5.4989 0.4477 17.0567 9.4713 113.5974 3.9259 81.6870 240.5467 37.4039 10.5270 27.9003 18.9959 17.9909 24.3312 0.9590 74.3421 20.9745
temp: 298.150 k
press: 1.00000 atm
elementType: 16 7 6 6 6 6 6 6 6 1 1 1 1 1 1 1 1 1
symmnumber: 1
zpe: 375400.3 jmol-1
zpe.correction: 0.142982 hartree
zpe.thermalcorrener: 0.152588 hartree
zpe.thermalcorrenthalpy: 0.153532 hartree
zpe.thermalcorrgfe: 0.107534 hartree
zpe.sumelectzpe: -724.288938 hartree
zpe.sumelectthermal: -724.279333 hartree
zpe.sumelectthermalent: -724.278389 hartree
zpe.sumelectthermalfe: -724.324387 hartree
dipole: -3.4323 -0.0090 1.9301
dipole: 3.9378
quadrupole: -45.7691 -55.1291 -65.9679
quadrupole: -0.0175 2.8844 0.0165
quadrupole: 9.8530 0.4929 -10.3459 -0.0175 2.8844 0.0165
hfenergy: -724.4319208 hartree
pointgroup: C01 [X(C7H9N1S1)]
dipole: -1.3236182 -0.2428512 0.7676279 debye
dipolederiv: 0.0218398 0.0232911 -0.0716308 0.0321043 -0.1641775 -0.0650154 -0.0974949 -0.0653555 0.0281015 -1.6423784 -0.0367725 0.0868277 -0.0580139 -0.1482212 0.1892079 0.1566638 0.1896722 -0.7144559 0.1856429 0.0103557 -0.0250691 -0.0274471 -0.2261684 0.0045077 0.0984399 0.0051705 -0.2387945 1.7098994 0.0739777 -0.2059644 0.0894001 0.0136076 -0.0551671 -0.2566776 -0.0555128 0.1739912 0.1100561 -0.0879223 -0.067881 -0.0991475 0.1174601 0.0518221 -0.0606969 0.0737766 -0.064678 0.1071084 0.1104895 -0.0080584 0.1154482 0.1222568 0.0711195 0.005293 0.0493134 -0.066623 -0.4511924 0.0387646 0.0166335 -0.3774917 0.0130657 0.1222557 -0.0836128 0.06586 -0.2006108 -0.4555033 -0.0479224 -0.0089673 0.3540401 0.038113 0.0352873 0.1376053 0.0920994 -0.2213158 -0.0893262 -0.0392785 0.1255317 -0.0253103 0.0554303 -0.0105715 0.0789337 -0.0106224 0.0904495 0.0676046 -0.092782 -0.0056939 -0.0777174 -0.0239809 -0.038509 -0.0053996 -0.0374224 0.1290416 0.0652924 0.0816122 0.0472321 0.0689186 -0.0101447 -0.0546027 0.0390771 -0.0557298 0.1173489 -0.0350417 0.0982781 0.0586486 0.0869201 -0.0390713 -0.073622 0.0598506 -0.0790927 0.1388404 -0.0322568 -0.1137964 -0.0056322 -0.1049866 -0.0576583 -0.0557776 0.001533 -0.0502663 0.1546526 0.2172616 -0.018966 0.0272519 -0.0385899 0.1348733 -0.072484 0.0146436 -0.0718778 0.3633924 0.216664 0.0019388 0.0336053 0.0253286 0.1387734 -0.0767255 0.0339369 -0.0773937 0.360127 0.0967975 -0.0734394 -0.0104936 -0.0214706 -0.0957398 0.0877553 -0.0382651 0.0708194 -0.0137372 0.0956511 0.0676932 0.0333467 0.0400401 0.0040549 -0.0761374 -0.0195526 -0.0597153 -0.1129669 -0.1881189 0.0044784 -0.0196867 0.0179748 0.1275271 0.0166567 -0.0642773 0.0162773 0.0772369 unknown
polarizability: 152.8830389|1.4873033|86.8741273|-3.6144512|8.5692588|60.897151 unknown
InChI: InChI=1S/C7H9NS/c1-9-7-4-2-6(8)3-5-7/h2-5H,8H2,1H3
charge 0 multiplicity 1
18 atoms
S  2.729196 0.142513 -0.72736
N  -3.267365 -0.211342 0.305015
C  0.92063 0.026798 -0.38693
C  -1.892545 -0.133106 0.077456
C  0.20373 1.15536 0.078771
C  0.219928 -1.179761 -0.627304
C  -1.183832 1.082368 0.311313
C  -1.167496 -1.265531 -0.398341
C  3.409858 -0.370524 0.966262
H  0.737119 2.096422 0.251897
H  0.765825 -2.052156 -1.002867
H  -1.724204 1.967299 0.669614
H  -1.695249 -2.207494 -0.592363
H  -3.787474 0.595574 0.636077
H  -3.77618 -1.072885 0.131606
H  3.077135 -1.391003 1.210405
H  3.069744 0.338133 1.736856
H  4.508279 -0.340664 0.883395
