program: Orca
programVersion: 5.0.2
elementType: S S O N N N N C C C C C C C C C C C C C C H H H H H H H H H H H H H H H H
charge: 0
multiplicity: 1
keywords: wb97x-d3
keywords: def2-TZVPP
keywords: def2/J RIJCOSX
keywords: DEFGRID2
keywords: scfconv7
keywords: smallprint printgap noloewdin
keywords: NOSOSCF
formula: C14H16N4OS2
InChI: InChI=1/C14H16N4OS2/c1-3-9-12(21-14(18-9)16-4-2)13(19)17-10(8-15)11-6-5-7-20-11/h5-7,10,16-17H,3-4H2,1-2H3
37 atoms
S  -1.733895 0.922838 -0.259933
S  3.248009 0.120614 1.80197
O  0.513464 -2.302645 -0.505849
N  1.10619 -0.125643 -0.459124
N  -3.416678 -0.865151 0.493041
N  -4.326357 1.277712 0.346946
N  2.924084 0.371888 -3.296203
C  -2.238051 -1.51262 0.316305
C  -1.18545 -0.727258 -0.084434
C  -2.218324 -2.990258 0.537797
C  2.473344 -0.375251 -0.82541
C  -3.310883 0.406015 0.240165
C  0.18536 -1.140633 -0.367197
C  3.434256 0.314182 0.10243
C  -2.572503 -3.747001 -0.741442
C  -4.260457 2.64716 -0.104454
C  4.511215 1.091065 -0.194989
C  -5.532654 3.390538 0.252823
C  5.198943 1.535518 0.965532
C  2.729307 0.036505 -2.214651
C  4.626552 1.085863 2.112791
H  -1.242704 -3.312717 0.894301
H  -2.951475 -3.215295 1.313965
H  2.616316 -1.459797 -0.779906
H  0.852726 0.830976 -0.272893
H  -2.613205 -4.81919 -0.550016
H  -1.824121 -3.57189 -1.512225
H  -3.544362 -3.437275 -1.125534
H  -5.228638 0.858429 0.504345
H  -3.407055 3.138303 0.373047
H  -4.08978 2.694811 -1.186532
H  4.804895 1.339848 -1.205046
H  -5.697699 3.39576 1.330022
H  -5.469904 4.424074 -0.082979
H  -6.404688 2.944059 -0.227306
H  6.075253 2.165814 0.941694
H  4.936507 1.279361 3.127331
totalener: -1633.82996076 hartree
nucrepener: 1868.56553352 hartree
electener: -3502.39549428 hartree
oneelecener: -5950.78928143 hartree
twoeener: 2448.39378715 hartree
kineticenergy: 1628.92392322 hartree
xcener: -119.653483081888 hartree
chargesum: -0.0000000
charge: -0.051368 0.070833 -0.423376 -0.229674 -0.326630 -0.194304 -0.010239 0.068253 -0.091845 -0.088414 0.322874 0.232542 0.408973 -0.081357 -0.260254 -0.021963 -0.187837 -0.267837 -0.140716 -0.267843 -0.151108 0.077048 0.079478 0.134856 0.141251 0.081570 0.096935 0.084179 0.144445 0.086431 0.100950 0.138913 0.096493 0.086332 0.080607 0.133889 0.127910
qa: -0.0514 0.0708 -0.4234 -0.2297 -0.3266 -0.1943 -0.0102 0.0683 -0.0918 -0.0884 0.3229 0.2325 0.4090 -0.0814 -0.2603 -0.0220 -0.1878 -0.2678 -0.1407 -0.2678 -0.1511 0.0770 0.0795 0.1349 0.1413 0.0816 0.0969 0.0842 0.1444 0.0864 0.1009 0.1389 0.0965 0.0863 0.0806 0.1339 0.1279
va: 2.6461 2.7859 2.0927 3.1611 3.0451 3.1537 3.1222 4.0176 3.6493 3.8850 3.6935 4.1964 4.0704 3.8906 3.9104 3.8657 3.9697 3.9702 4.0128 4.0489 4.0222 1.0268 1.0193 1.0407 1.0470 1.0065 1.0118 1.0065 1.0389 0.9898 0.9901 1.0187 1.0018 1.0087 1.0012 1.0034 1.0060
dispcorr: -0.015815522 hartree
energy: -1633.845776285206
dipole: -21.97420 20.78562 -1.18858 2.55888 -0.76820 1.79067 1.28485 0.10818 1.39303
magnitude: 2.56120 au
magnitude: 6.51006 debye
