program: Orca
programVersion: 5.0.2
elementType: S S O N N N N C C C C C C C C C C C C C C H H H H H H H H H H H H H H H H
charge: 0
multiplicity: 1
keywords: wb97x-d3
keywords: def2-TZVPP
keywords: def2/J RIJCOSX
keywords: DEFGRID2
keywords: scfconv7
keywords: smallprint printgap noloewdin
keywords: NOSOSCF
formula: C14H16N4OS2
InChI: InChI=1/C14H16N4OS2/c1-3-9-12(21-14(18-9)16-4-2)13(19)17-10(8-15)11-6-5-7-20-11/h5-7,10,16-17H,3-4H2,1-2H3
37 atoms
S  -1.597365 1.288452 -0.739276
S  3.034358 0.222559 1.744912
O  0.438704 -2.090608 -0.586483
N  1.17293 0.037589 -0.765105
N  -3.432345 -0.349021 -0.009879
N  -4.204364 1.827992 -0.331321
N  3.375047 0.248308 -3.353891
C  -2.295676 -1.083486 -0.097994
C  -1.171418 -0.384556 -0.465041
C  -2.355566 -2.547915 0.2172
C  2.549943 -0.336168 -0.9382
C  -3.232537 0.899981 -0.308537
C  0.183194 -0.902388 -0.610972
C  3.443978 0.321509 0.076656
C  -3.698802 -3.003399 0.766466
C  -5.545566 1.526807 0.132404
C  4.604802 1.005919 -0.111107
C  -5.673417 1.473454 1.647075
C  5.174337 1.457111 1.109319
C  3.013418 -0.016392 -2.29617
C  4.431861 1.10418 2.191085
H  -2.109317 -3.107235 -0.688268
H  -1.556024 -2.794413 0.917378
H  2.591609 -1.4250 -0.828567
H  0.976163 1.022862 -0.698162
H  -3.959357 -2.479506 1.685262
H  -3.661893 -4.069835 0.988105
H  -4.505717 -2.835228 0.055355
H  -3.936075 2.793645 -0.396971
H  -6.205376 2.288824 -0.283884
H  -5.844947 0.574302 -0.303118
H  5.039462 1.185563 -1.084191
H  -5.040173 0.68944 2.05921
H  -5.393452 2.421911 2.106523
H  -6.703377 1.256833 1.931346
H  6.091855 2.022687 1.172774
H  4.627915 1.322347 3.228731
totalener: -1633.82776071 hartree
nucrepener: 1870.91042664 hartree
electener: -3504.73818735 hartree
oneelecener: -5955.65623277 hartree
twoeener: 2450.91804542 hartree
kineticenergy: 1628.93029086 hartree
xcener: -119.655696684994 hartree
chargesum: 0.0000000
charge: -0.044458 0.070296 -0.418628 -0.224266 -0.356539 -0.217755 -0.009870 0.087390 -0.126644 -0.060645 0.311976 0.257193 0.394358 -0.066502 -0.235792 0.004800 -0.198513 -0.237739 -0.136642 -0.264952 -0.153743 0.082130 0.076387 0.134460 0.139735 0.074695 0.085393 0.078873 0.132057 0.086848 0.087825 0.139712 0.095775 0.069216 0.082585 0.133758 0.127226
qa: -0.0445 0.0703 -0.4186 -0.2243 -0.3565 -0.2178 -0.0099 0.0874 -0.1266 -0.0606 0.3120 0.2572 0.3944 -0.0665 -0.2358 0.0048 -0.1985 -0.2377 -0.1366 -0.2650 -0.1537 0.0821 0.0764 0.1345 0.1397 0.0747 0.0854 0.0789 0.1321 0.0868 0.0878 0.1397 0.0958 0.0692 0.0826 0.1338 0.1272
va: 2.6268 2.7856 2.1094 3.1493 2.9715 3.2037 3.1204 4.0001 3.6921 3.9097 3.7094 4.1377 4.0965 3.8793 3.9360 3.8743 3.9777 3.9052 4.0087 4.0467 4.0246 1.0110 1.0145 1.0432 1.0459 1.0068 1.0061 1.0086 1.0331 0.9980 1.0162 1.0188 1.0127 1.0104 1.0108 1.0033 1.0063
dispcorr: -0.016296257 hartree
energy: -1633.844056970937
dipole: -26.55483 25.29073 -1.26410 -2.65951 4.36235 1.70284 9.84047 -8.30419 1.53628
magnitude: 2.61873 au
magnitude: 6.65629 debye
