program: Orca
programVersion: 5.0.2
elementType: S S O N N N N C C C C C C C C C C C C C C H H H H H H H H H H H H H H H H
charge: 0
multiplicity: 1
keywords: wb97x-d3
keywords: def2-TZVPP
keywords: def2/J RIJCOSX
keywords: DEFGRID2
keywords: scfconv7
keywords: smallprint printgap noloewdin
keywords: NOSOSCF
formula: C14H16N4OS2
InChI: InChI=1/C14H16N4OS2/c1-3-9-12(21-14(18-9)16-4-2)13(19)17-10(8-15)11-6-5-7-20-11/h5-7,10,16-17H,3-4H2,1-2H3
37 atoms
S  -1.809114 1.00479 -0.233537
S  2.869558 0.218995 1.735053
O  0.456105 -2.209722 -0.656694
N  1.002637 -0.023829 -0.718189
N  -3.541756 -0.856939 0.117599
N  -4.42124 1.293326 0.316765
N  3.097672 0.523043 -3.351498
C  -2.364438 -1.484772 -0.121431
C  -1.284153 -0.660388 -0.33134
C  -2.359204 -2.979613 -0.089039
C  2.396144 -0.278077 -0.959655
C  -3.412368 0.437232 0.097242
C  0.098787 -1.049915 -0.583249
C  3.277272 0.372249 0.071548
C  -1.972996 -3.511587 1.290115
C  -4.316137 2.723227 0.152896
C  4.435696 1.066245 -0.096354
C  -5.603317 3.406482 0.571673
C  5.005432 1.479247 1.137443
C  2.788918 0.16279 -2.30533
C  4.265041 1.088833 2.208137
H  -3.36671 -3.312679 -0.341212
H  -1.676753 -3.375336 -0.83729
H  2.519567 -1.365724 -0.926458
H  0.721693 0.940837 -0.655189
H  -2.639025 -3.126691 2.062256
H  -0.952221 -3.231333 1.543635
H  -2.034006 -4.59958 1.307431
H  -5.332069 0.870258 0.389773
H  -3.490162 3.094149 0.768139
H  -4.077642 2.978468 -0.886425
H  4.867759 1.278832 -1.064081
H  -5.835823 3.205135 1.617037
H  -5.51218 4.484137 0.450094
H  -6.445917 3.07899 -0.038715
H  5.920755 2.046219 1.218792
H  4.461019 1.275936 3.251904
totalener: -1633.82952712 hartree
nucrepener: 1876.49937084 hartree
electener: -3510.32889796 hartree
oneelecener: -5966.64188539 hartree
twoeener: 2456.31298743 hartree
kineticenergy: 1628.92543036 hartree
xcener: -119.654924419065 hartree
chargesum: 0.0000000
charge: -0.058745 0.070423 -0.427504 -0.224889 -0.325127 -0.193491 -0.008733 0.071588 -0.083141 -0.091439 0.303922 0.236243 0.401553 -0.046897 -0.263473 -0.023490 -0.211031 -0.269474 -0.133738 -0.264071 -0.156977 0.079701 0.085699 0.134602 0.139603 0.085735 0.091847 0.082918 0.145030 0.089019 0.099671 0.139227 0.096227 0.085994 0.082988 0.133544 0.126686
qa: -0.0587 0.0704 -0.4275 -0.2249 -0.3251 -0.1935 -0.0087 0.0716 -0.0831 -0.0914 0.3039 0.2362 0.4016 -0.0469 -0.2635 -0.0235 -0.2110 -0.2695 -0.1337 -0.2641 -0.1570 0.0797 0.0857 0.1346 0.1396 0.0857 0.0918 0.0829 0.1450 0.0890 0.0997 0.1392 0.0962 0.0860 0.0830 0.1335 0.1267
va: 2.6387 2.7899 2.0912 3.1589 3.0503 3.1558 3.1196 4.0122 3.6374 3.8647 3.7215 4.1995 4.0869 3.8805 3.9244 3.8634 3.9939 3.9700 4.0062 4.0465 4.0272 1.0209 1.0267 1.0426 1.0459 1.0041 1.0103 1.0066 1.0392 0.9894 0.9902 1.0183 1.0016 1.0089 1.0008 1.0031 1.0066
dispcorr: -0.015939732 hartree
energy: -1633.845466847108
dipole: -20.36160 18.97566 -1.38594 2.48806 -0.73567 1.75239 6.96572 -5.46430 1.50142
magnitude: 2.69183 au
magnitude: 6.84210 debye
