program: Gaussian 09
title: 000066037
version: EM64L-G09RevD.01
frameworkgroup: C1[X(C7H7BrS)]
method: RPBEPBE
basis: SDD
operation: Freq
keyword: #p
keyword: freq=noraman
keyword: PBEPBE/SDD
title: #p freq=noraman PBEPBE/SDD
converged: YES YES NO NO
title: Mulliken charges:
elementType: Br S C C C C C C C H H H H H H H
charge: 0.003168 0.210711 -0.191387 -0.152343 -0.217205 -0.202202 -0.178538 -0.200852 -0.864015 0.243967 0.247774 0.250078 0.252796 0.266473 0.264970 0.266604
chargesum: 0.00000
title: Mulliken charges with hydrogens summed into heavy atoms:
elementType: Br S C C C C C C C
charge: 0.003168 0.210711 -0.191387 0.091624 0.030569 0.047876 0.074259 -0.200852 -0.065968
polarizability: 1.83526215e+02 2.56101283e+00 9.68977424e+01 1.28998150e-02 2.17447390e-02 4.29636777e+01
1716.lowfreq: -4.3935 -0.0021 -0.0018 0.0017 5.5290 13.9029 48.4145 83.1010 140.6002
frequency: 48.0093 83.0897 140.6001 218.9535 219.6356 259.9469 276.2041 350.3646 405.4286 457.7262 479.5835 619.3436 668.9250 693.5995 701.7313 810.2735 818.5405 940.9256 958.6712 968.5548 981.3430 994.9023 1058.2167 1074.8133 1115.4935 1192.5004 1291.0453 1347.1151 1355.2859 1387.5334 1455.2046 1455.4289 1465.0803 1569.6487 1578.4364 3008.2340 3125.3123 3135.9602 3140.6488 3151.2556 3170.8905 3174.4411
redmass: 3.3334 9.0079 4.8261 6.7933 1.1843 7.0010 3.9579 4.3838 2.8973 8.7588 2.9567 7.1128 7.1665 3.8650 7.4332 1.4270 1.2853 1.3233 1.3614 1.1800 2.9101 1.6273 4.9387 2.2288 1.3811 1.1214 1.2406 1.5338 2.3309 3.6450 1.2396 1.4030 1.1678 7.4603 6.1674 1.0291 1.1063 1.1019 1.0896 1.0877 1.0960 1.0966
irintensity: 1.9138 0.5982 0.9192 0.9745 0.1233 0.0183 0.1424 0.9755 0.0327 22.1592 32.1943 0.0726 2.3750 0.0053 1.8710 60.0329 12.0068 0.5887 0.0819 9.2579 74.5021 15.2416 1.3433 74.4187 5.7929 2.7001 0.2836 0.7630 7.1221 4.0329 64.7966 93.3027 3.4224 0.8496 3.3729 23.4726 17.8071 8.0959 3.5819 2.9254 11.0088 0.4517
temp: 298.150 k
press: 1.00000 atm
elementType: 35 16 6 6 6 6 6 6 6 1 1 1 1 1 1 1
symmnumber: 1
zpe: 307134.6 jmol-1
zpe.correction: 0.116981 hartree
zpe.thermalcorrener: 0.126247 hartree
zpe.thermalcorrenthalpy: 0.127192 hartree
zpe.thermalcorrgfe: 0.080730 hartree
zpe.sumelectzpe: -681.801532 hartree
zpe.sumelectthermal: -681.792266 hartree
zpe.sumelectthermalent: -681.791321 hartree
zpe.sumelectthermalfe: -681.837783 hartree
dipole: -2.2961 -1.3783 0.0074
dipole: 2.6781
quadrupole: -66.6124 -62.1363 -74.5680
quadrupole: 7.4387 -0.0267 0.0123
quadrupole: 1.1599 5.6359 -6.7958 7.4387 -0.0267 0.0123
hfenergy: -681.918513 hartree
pointgroup: C01 [X(C7H7Br1S1)]
dipole: -0.9315982 0.474982 0.1290157 debye
dipolederiv: -0.7587957 -0.0932673 0.074435 -0.1141806 -0.0884846 0.0099389 0.0736193 0.0076898 -0.0502351 -0.6458778 0.0463078 0.0649455 -0.0811818 0.0462968 0.0160853 0.0583953 0.0026592 -0.0919389 1.1168362 0.1205489 -0.1254207 0.181906 -0.1492564 -0.0240552 -0.1219678 -0.0176032 -0.060513 -0.3285458 -0.0615392 0.0179701 -0.1653631 -0.0095699 0.0257699 0.0126935 0.0142921 -0.1325785 -0.3703194 0.0263525 0.0292546 0.0380574 0.0807449 0.0083774 0.0294307 0.0097941 -0.1250698 -0.2512012 -0.0037306 0.0177948 -0.0732121 0.0642614 0.0177733 0.0136843 0.0102858 -0.0929184 -0.2038406 -0.1043742 0.005717 0.017428 0.0528737 0.0070983 0.0135558 0.0205097 -0.0950711 1.2030819 0.2030929 -0.1380914 0.1692032 -0.0267968 -0.0120296 -0.1408498 -0.0160479 -0.124964 0.0147365 -0.1118326 0.0001694 -0.1372299 0.0952916 0.0170579 -0.0025741 0.0139937 0.0755491 0.0050197 0.0896347 0.0219143 0.075645 -0.00548 -0.0179931 0.0211461 -0.0195458 0.1482186 0.0456686 -0.084582 0.0079069 -0.0591472 -0.0278412 -0.0052799 0.009304 -0.0024489 0.16119 0.0605708 -0.0553534 0.0079635 -0.059882 -0.0331226 -0.0053286 0.0076405 -0.0058218 0.16173 0.0246145 0.0813335 0.0205709 0.0741983 0.0130513 -0.017575 0.0202614 -0.0182644 0.1612375 0.0858572 -0.0274868 -0.0773811 0.0657271 -0.0442227 -0.1050451 -0.0513955 -0.0728882 -0.0316924 -0.1060743 -0.0057612 0.0252745 -0.0130379 0.0957115 -0.0010226 0.0249706 -0.0018547 0.1311009 0.1082696 -0.0193431 0.0469767 0.0810696 -0.063457 0.0862283 0.0320858 0.0752504 -0.0340448 unknown
polarizability: 181.773368|4.0300677|96.7891467|-15.2169176|2.7803654|44.8251206 unknown
InChI: InChI=1S/C7H7BrS/c1-9-7-4-2-6(8)3-5-7/h2-5H,1H3
charge 0 multiplicity 1
16 atoms
Br 3.763725 0.370302 -0.285993
S  -2.711275 -0.819753 0.365902
C  -0.936264 -0.40052 0.193115
C  -0.42378 0.918313 0.21573
C  -0.042965 -1.491331 0.026583
C  0.964913 1.148847 0.075016
C  1.342681 -1.269244 -0.114941
C  1.833937 0.053631 -0.088772
C  -3.510898 0.868288 0.54887
H  -1.084417 1.781164 0.341752
H  -0.424824 -2.517907 0.005598
H  1.353093 2.171239 0.094369
H  2.023011 -2.115866 -0.242809
H  -3.14446 1.378203 1.453585
H  -4.588593 0.669352 0.651714
H  -3.334686 1.481981 -0.348219
