program: Orca
programVersion: 5.0.2
elementType: S S O N N N N C C C C C C C C C C C C C C H H H H H H H H H H H H H H H H
charge: 0
multiplicity: 1
keywords: wb97x-d3
keywords: def2-TZVPP
keywords: def2/J RIJCOSX
keywords: DEFGRID2
keywords: scfconv7
keywords: smallprint printgap noloewdin
keywords: NOSOSCF
formula: C14H16N4OS2
InChI: InChI=1/C14H16N4OS2/c1-3-9-12(21-14(18-9)16-4-2)13(19)17-10(8-15)11-6-5-7-20-11/h5-7,10,16-17H,3-4H2,1-2H3
37 atoms
S  -1.99983 -0.406308 1.788897
S  3.35541 0.236805 1.797658
O  0.634985 -1.564183 1.496413
N  1.189374 -0.76856 -0.546108
N  -2.97971 0.577164 -0.377727
N  -4.445318 0.664053 1.429292
N  3.370415 -2.021799 -2.782156
C  -1.721882 0.180026 -0.682884
C  -1.012849 -0.371364 0.355161
C  -1.243896 0.356519 -2.096684
C  2.547987 -1.246377 -0.424443
C  -3.264811 0.339858 0.874602
C  0.317351 -0.946426 0.4962
C  3.493236 -0.225467 0.147027
C  -2.361215 0.586856 -3.10402
C  -5.545121 1.172812 0.634183
C  4.481397 0.467949 -0.484821
C  -6.252428 0.107218 -0.189146
C  5.136929 1.387097 0.37499
C  3.012125 -1.689854 -1.742308
C  4.627926 1.367661 1.635589
H  -0.554332 1.208822 -2.136863
H  -0.665717 -0.521133 -2.394359
H  2.518459 -2.126645 0.223668
H  1.044787 0.004152 -1.175015
H  -2.91909 1.494275 -2.884302
H  -3.067482 -0.24208 -3.107516
H  -1.941728 0.67582 -4.105755
H  -4.647459 0.318954 2.350527
H  -6.24201 1.651618 1.323007
H  -5.157236 1.954267 -0.018867
H  4.740109 0.322766 -1.524598
H  -7.073878 0.549676 -0.753498
H  -5.564864 -0.349254 -0.899447
H  -6.667351 -0.677984 0.443567
H  5.948677 2.028693 0.06637
H  4.939292 1.960561 2.481033
totalener: -1633.82757980 hartree
nucrepener: 1886.40011203 hartree
electener: -3520.22769182 hartree
oneelecener: -5986.71261699 hartree
twoeener: 2466.48492517 hartree
kineticenergy: 1628.93674288 hartree
xcener: -119.658331203587 hartree
chargesum: 0.0000000
charge: 0.043646 0.090560 -0.419537 -0.206539 -0.377895 -0.219965 -0.007861 0.142620 -0.136791 -0.178483 0.266772 0.257660 0.355324 -0.039105 -0.251002 0.005574 -0.210426 -0.236275 -0.155520 -0.259651 -0.142169 0.080096 0.103831 0.131739 0.159935 0.087133 0.085135 0.088223 0.133335 0.084915 0.084482 0.136029 0.080981 0.094147 0.070066 0.132888 0.126126
qa: 0.0436 0.0906 -0.4195 -0.2065 -0.3779 -0.2200 -0.0079 0.1426 -0.1368 -0.1785 0.2668 0.2577 0.3553 -0.0391 -0.2510 0.0056 -0.2104 -0.2363 -0.1555 -0.2597 -0.1422 0.0801 0.1038 0.1317 0.1599 0.0871 0.0851 0.0882 0.1333 0.0849 0.0845 0.1360 0.0810 0.0941 0.0701 0.1329 0.1261
va: 2.7029 2.8107 2.0898 3.1527 2.9744 3.2048 3.1156 3.7911 3.7726 3.8856 3.8284 4.1050 4.1317 3.8363 3.9657 3.8754 3.9882 3.9021 4.0223 4.0228 4.0165 0.9948 1.0024 1.0297 1.0262 1.0098 1.0074 1.0049 1.0327 0.9983 1.0167 1.0187 1.0106 1.0132 1.0111 1.0039 1.0062
dispcorr: -0.016694509 hartree
energy: -1633.844274304284
dipole: -24.47251 22.93634 -1.53617 8.93116 -7.46160 1.46956 -13.52995 14.12583 0.59588
magnitude: 2.20783 au
magnitude: 5.61185 debye
