program: Orca
programVersion: 5.0.2
elementType: S S O N N N N C C C C C C C C C C C C C C H H H H H H H H H H H H H H H H
charge: 0
multiplicity: 1
keywords: wb97x-d3
keywords: def2-TZVPP
keywords: def2/J RIJCOSX
keywords: DEFGRID2
keywords: scfconv7
keywords: smallprint printgap noloewdin
keywords: NOSOSCF
formula: C14H16N4OS2
InChI: InChI=1/C14H16N4OS2/c1-3-9-12(21-14(18-9)16-4-2)13(19)17-10(8-15)11-6-5-7-20-11/h5-7,10,16-17H,3-4H2,1-2H3
37 atoms
S  -2.280724 -0.896137 1.377398
S  2.969927 0.51855 1.581171
O  0.419443 -1.863129 1.081687
N  1.052408 -0.71973 -0.762031
N  -3.206481 0.368912 -0.664532
N  -4.76339 0.089273 1.048076
N  3.366015 -1.807513 -2.961028
C  -1.92043 0.056802 -0.963673
C  -1.231489 -0.607573 0.017218
C  -1.411774 0.488742 -2.304028
C  2.436004 -1.103182 -0.620298
C  -3.534748 -0.062577 0.522782
C  0.126734 -1.119023 0.164483
C  3.285083 -0.013653 -0.024653
C  -0.877363 1.921418 -2.284441
C  -5.774512 0.897513 0.396789
C  4.308184 0.68521 -0.5893
C  -5.569125 2.394383 0.573762
C  4.844017 1.667999 0.284357
C  2.963619 -1.506532 -1.928095
C  4.21311 1.690828 1.487775
H  -0.657765 -0.206207 -2.67677
H  -2.24701 0.431951 -3.002863
H  2.453965 -1.984413 0.027676
H  0.873385 0.097652 -1.320521
H  -0.050899 2.047993 -1.581809
H  -1.659857 2.616734 -1.983517
H  -0.523086 2.217959 -3.271195
H  -4.891202 -0.129657 2.02007
H  -5.778304 0.641803 -0.662117
H  -6.739996 0.591332 0.801188
H  4.671599 0.504945 -1.591388
H  -5.578539 2.678251 1.626588
H  -4.619504 2.706081 0.141541
H  -6.364263 2.947358 0.072946
H  5.660611 2.32464 0.024084
H  4.418149 2.333553 2.329175
totalener: -1633.82828387 hartree
nucrepener: 1897.11413771 hartree
electener: -3530.94242158 hartree
oneelecener: -6007.94823067 hartree
twoeener: 2477.00580909 hartree
kineticenergy: 1628.93819370 hartree
xcener: -119.657159017601 hartree
chargesum: 0.0000000
charge: 0.044292 0.080743 -0.413384 -0.228683 -0.366942 -0.217760 -0.006743 0.079193 -0.105588 -0.155882 0.281077 0.262168 0.354554 -0.034399 -0.252864 0.006964 -0.221093 -0.238123 -0.142352 -0.260290 -0.148784 0.084984 0.090083 0.135397 0.167628 0.067616 0.096791 0.096489 0.132020 0.085305 0.085576 0.137903 0.069453 0.092962 0.081596 0.133455 0.126636
qa: 0.0443 0.0807 -0.4134 -0.2287 -0.3669 -0.2178 -0.0067 0.0792 -0.1056 -0.1559 0.2811 0.2622 0.3546 -0.0344 -0.2529 0.0070 -0.2211 -0.2381 -0.1424 -0.2603 -0.1488 0.0850 0.0901 0.1354 0.1676 0.0676 0.0968 0.0965 0.1320 0.0853 0.0856 0.1379 0.0695 0.0930 0.0816 0.1335 0.1266
va: 2.7002 2.7916 2.0995 3.1595 2.9883 3.2055 3.1150 3.9144 3.7100 3.8907 3.8021 4.0879 4.1361 3.8366 3.9096 3.8681 3.9912 3.9087 4.0096 4.0322 4.0195 1.0200 1.0237 1.0352 1.0282 1.0120 1.0055 1.0062 1.0332 1.0211 0.9981 1.0194 1.0103 1.0127 1.0110 1.0037 1.0069
dispcorr: -0.017163761 hartree
energy: -1633.845447626783
dipole: -18.83798 17.40568 -1.43230 17.91978 -16.13716 1.78262 -8.24799 9.00654 0.75855
magnitude: 2.40928 au
magnitude: 6.12390 debye
