program: Orca
programVersion: 5.0.2
elementType: S S O N N N N C C C C C C C C C C C C C C H H H H H H H H H H H H H H H H
charge: 0
multiplicity: 1
keywords: wb97x-d3
keywords: def2-TZVPP
keywords: def2/J RIJCOSX
keywords: DEFGRID2
keywords: scfconv7
keywords: smallprint printgap noloewdin
keywords: NOSOSCF
formula: C14H16N4OS2
InChI: InChI=1/C14H16N4OS2/c1-3-9-12(21-14(18-9)16-4-2)13(19)17-10(8-15)11-6-5-7-20-11/h5-7,10,16-17H,3-4H2,1-2H3
37 atoms
S  -1.327917 1.222046 0.02988
S  3.190691 0.651819 1.748193
O  0.412618 -2.310251 -0.098489
N  1.279663 -0.254257 -0.452197
N  -3.389358 -0.303155 -0.122026
N  -3.919715 1.957764 0.085467
N  3.325529 -0.90193 -3.105687
C  -2.310262 -1.122206 -0.217754
C  -1.089526 -0.500089 -0.162274
C  -2.563057 -2.590226 -0.331328
C  2.624791 -0.745038 -0.586774
C  -3.042826 0.943158 0.000188
C  0.230026 -1.117447 -0.235503
C  3.601549 0.111813 0.168234
C  -2.660752 -3.241704 1.047657
C  -5.34188 1.71242 0.2331
C  4.854063 0.507198 -0.185842
C  -5.743567 1.26682 1.630439
C  5.496394 1.254815 0.83674
C  3.021789 -0.842819 -1.999247
C  4.714096 1.409265 1.936987
H  -3.504201 -2.72036 -0.867644
H  -1.778073 -3.073293 -0.908529
H  2.626352 -1.762466 -0.182833
H  1.107623 0.681086 -0.78624
H  -3.437893 -2.77185 1.650635
H  -1.71403 -3.160822 1.578672
H  -2.903558 -4.299937 0.953193
H  -3.570942 2.867587 0.329342
H  -5.85447 2.635159 -0.040648
H  -5.630286 0.959128 -0.499036
H  5.30398 0.276256 -1.141142
H  -5.481698 2.014431 2.379886
H  -6.820905 1.10746 1.68083
H  -5.253857 0.330044 1.891937
H  6.491868 1.663682 0.749004
H  4.949034 1.939503 2.846094
totalener: -1633.82933827 hartree
nucrepener: 1875.99687046 hartree
electener: -3509.82620873 hartree
oneelecener: -5965.80216019 hartree
twoeener: 2455.97595146 hartree
kineticenergy: 1628.93712931 hartree
xcener: -119.654044078910 hartree
chargesum: -0.0000000
charge: -0.039846 0.068257 -0.420695 -0.237544 -0.350204 -0.218140 -0.006206 0.061635 -0.089532 -0.086906 0.314958 0.266254 0.401937 -0.054020 -0.261745 0.007435 -0.201557 -0.237320 -0.142055 -0.273583 -0.150153 0.079905 0.080480 0.132294 0.142271 0.082832 0.095722 0.083395 0.131631 0.085411 0.087625 0.139275 0.067966 0.082388 0.097083 0.133539 0.127214
qa: -0.0398 0.0683 -0.4207 -0.2375 -0.3502 -0.2181 -0.0062 0.0616 -0.0895 -0.0869 0.3150 0.2663 0.4019 -0.0540 -0.2617 0.0074 -0.2016 -0.2373 -0.1421 -0.2736 -0.1502 0.0799 0.0805 0.1323 0.1423 0.0828 0.0957 0.0834 0.1316 0.0854 0.0876 0.1393 0.0680 0.0824 0.0971 0.1335 0.1272
va: 2.6265 2.7926 2.0911 3.1583 2.9945 3.2092 3.1199 4.0277 3.6684 3.8891 3.7400 4.1169 4.0585 3.8912 3.9146 3.8675 3.9924 3.9076 4.0153 4.0502 4.0215 1.0190 1.0260 1.0374 1.0444 1.0045 1.0125 1.0064 1.0334 0.9981 1.0192 1.0170 1.0104 1.0108 1.0126 1.0034 1.0061
dispcorr: -0.016481494 hartree
energy: -1633.845819766459
dipole: -25.09505 24.04442 -1.05064 -2.78695 4.80680 2.01986 7.07383 -5.72768 1.34615
magnitude: 2.64495 au
magnitude: 6.72293 debye
