program: Orca
programVersion: 5.0.2
elementType: S S O N N N N C C C C C C C C C C C C C C H H H H H H H H H H H H H H H H
charge: 0
multiplicity: 1
keywords: wb97x-d3
keywords: def2-TZVPP
keywords: def2/J RIJCOSX
keywords: DEFGRID2
keywords: scfconv7
keywords: smallprint printgap noloewdin
keywords: NOSOSCF
formula: C14H16N4OS2
InChI: InChI=1/C14H16N4OS2/c1-3-9-12(21-14(18-9)16-4-2)13(19)17-10(8-15)11-6-5-7-20-11/h5-7,10,16-17H,3-4H2,1-2H3
37 atoms
S  -2.597146 -0.658709 -1.48036
S  2.970932 -1.210688 1.587094
O  0.137376 -1.247357 -1.972362
N  1.16976 0.141877 -0.523967
N  -3.06023 1.114514 0.325974
N  -4.99064 0.233111 -0.636248
N  3.396369 1.482122 -2.736698
C  -1.710859 1.015925 0.231202
C  -1.248873 0.104846 -0.684206
C  -0.911844 1.872143 1.166705
C  2.488625 -0.223336 -0.967002
C  -3.654354 0.305047 -0.509672
C  0.055156 -0.381608 -1.122234
C  3.437698 -0.315049 0.193515
C  -0.477516 1.115013 2.421707
C  -5.880084 0.925823 0.273781
C  4.692675 0.193104 0.325127
C  -5.990843 0.265459 1.639688
C  5.290951 -0.149846 1.567261
C  3.001688 0.725493 -1.967749
C  4.473573 -0.903891 2.347682
H  -0.050751 2.319697 0.662334
H  -1.545151 2.711902 1.452495
H  2.401227 -1.194692 -1.463394
H  1.098354 0.950097 0.069578
H  0.178103 0.275764 2.188462
H  -1.346977 0.719198 2.945146
H  0.05512 1.774852 3.106304
H  -5.373342 -0.506033 -1.19847
H  -5.525161 1.950479 0.379918
H  -6.856223 0.976189 -0.209727
H  5.176217 0.78978 -0.435411
H  -6.685438 0.818407 2.272602
H  -6.355945 -0.758868 1.559487
H  -5.022726 0.248317 2.137556
H  6.281424 0.160678 1.864527
H  4.672152 -1.288985 3.335165
totalener: -1633.82751524 hartree
nucrepener: 1888.85825712 hartree
electener: -3522.68577236 hartree
oneelecener: -5991.37689328 hartree
twoeener: 2468.69112092 hartree
kineticenergy: 1628.94428179 hartree
xcener: -119.659098933684 hartree
chargesum: 0.0000000
charge: 0.049252 0.061162 -0.414216 -0.261108 -0.363539 -0.217999 -0.004883 0.081269 -0.118071 -0.158324 0.336463 0.267123 0.374033 -0.081638 -0.239659 0.005374 -0.178514 -0.237337 -0.145881 -0.278632 -0.145244 0.071873 0.096025 0.134327 0.165350 0.064807 0.096271 0.091083 0.133030 0.085360 0.084704 0.140116 0.081229 0.069425 0.093826 0.134158 0.128787
qa: 0.0493 0.0612 -0.4142 -0.2611 -0.3635 -0.2180 -0.0049 0.0813 -0.1181 -0.1583 0.3365 0.2671 0.3740 -0.0816 -0.2397 0.0054 -0.1785 -0.2373 -0.1459 -0.2786 -0.1452 0.0719 0.0960 0.1343 0.1654 0.0648 0.0963 0.0911 0.1330 0.0854 0.0847 0.1401 0.0812 0.0694 0.0938 0.1342 0.1288
va: 2.7085 2.7730 2.1080 3.1807 2.9888 3.2054 3.1207 3.9278 3.7047 3.9096 3.7045 4.0814 4.1170 3.8734 3.9130 3.8717 3.9759 3.9018 4.0186 4.0527 4.0119 1.0103 1.0255 1.0337 1.0356 1.0190 1.0063 1.0066 1.0328 1.0196 0.9982 1.0176 1.0108 1.0108 1.0147 1.0035 1.0051
dispcorr: -0.017400646 hartree
energy: -1633.844915884042
dipole: -17.25119 15.99460 -1.25659 8.14887 -8.19930 -0.05043 17.47429 -15.49426 1.98003
magnitude: 2.34565 au
magnitude: 5.96218 debye
