program: Orca
programVersion: 5.0.2
elementType: S S O N N N N C C C C C C C C C C C C C C H H H H H H H H H H H H H H H H
charge: 0
multiplicity: 1
keywords: wb97x-d3
keywords: def2-TZVPP
keywords: def2/J RIJCOSX
keywords: DEFGRID2
keywords: scfconv7
keywords: smallprint printgap noloewdin
keywords: NOSOSCF
formula: C14H16N4OS2
InChI: InChI=1/C14H16N4OS2/c1-3-9-12(21-14(18-9)16-4-2)13(19)17-10(8-15)11-6-5-7-20-11/h5-7,10,16-17H,3-4H2,1-2H3
37 atoms
S  -2.537148 0.239622 -1.380813
S  4.093971 -0.041899 1.444158
O  0.236412 -0.048823 -2.27681
N  1.256905 0.46115 -0.325536
N  -2.830647 -0.079663 1.158422
N  -4.838216 0.114286 -0.003587
N  3.556261 2.8737 -0.994335
C  -1.49468 -0.076658 0.92842
C  -1.120259 0.107346 -0.37815
C  -0.606897 -0.2774 2.118303
C  2.585676 0.442818 -0.877913
C  -3.498684 0.081744 0.048562
C  0.160087 0.154997 -1.080653
C  3.505644 -0.465073 -0.115851
C  -0.39833 1.016556 2.904413
C  -5.595299 0.352325 -1.207814
C  3.915399 -1.710752 -0.478096
C  -7.08333 0.286705 -0.924654
C  4.709585 -2.336205 0.51807
C  3.132702 1.806326 -0.955589
C  4.881546 -1.550873 1.614384
H  -1.092275 -1.010085 2.764604
H  0.348884 -0.716003 1.82814
H  2.495654 0.067531 -1.90077
H  1.14657 0.77414 0.623293
H  -1.353422 1.418358 3.239401
H  0.08303 1.791895 2.304614
H  0.223401 0.842415 3.78211
H  -5.310379 0.0730 0.884188
H  -5.340263 1.329978 -1.632645
H  -5.330566 -0.397863 -1.96062
H  3.651879 -2.167821 -1.421438
H  -7.647562 0.457754 -1.839403
H  -7.369439 -0.690227 -0.534467
H  -7.385469 1.048018 -0.20451
H  5.138046 -3.322257 0.418999
H  5.446287 -1.772346 2.505786
totalener: -1633.82729538 hartree
nucrepener: 1872.92352742 hartree
electener: -3506.75082279 hartree
oneelecener: -5959.41256544 hartree
twoeener: 2452.66174264 hartree
kineticenergy: 1628.93671236 hartree
xcener: -119.657188755580 hartree
chargesum: 0.0000000
charge: 0.037166 0.059277 -0.414373 -0.211030 -0.351717 -0.197547 -0.003539 0.089534 -0.102210 -0.154233 0.228530 0.232303 0.357982 0.002141 -0.251156 -0.022130 -0.184377 -0.275551 -0.150128 -0.252847 -0.140230 0.088174 0.073207 0.121251 0.160402 0.099486 0.073551 0.092270 0.141155 0.098403 0.093857 0.133522 0.086373 0.093343 0.085495 0.133702 0.129944
qa: 0.0372 0.0593 -0.4144 -0.2110 -0.3517 -0.1975 -0.0035 0.0895 -0.1022 -0.1542 0.2285 0.2323 0.3580 0.0021 -0.2512 -0.0221 -0.1844 -0.2756 -0.1501 -0.2528 -0.1402 0.0882 0.0732 0.1213 0.1604 0.0995 0.0736 0.0923 0.1412 0.0984 0.0939 0.1335 0.0864 0.0933 0.0855 0.1337 0.1299
va: 2.7164 2.7710 2.1077 3.1769 3.0395 3.1402 3.1159 3.9210 3.6770 3.8927 3.8194 4.1688 4.1662 3.7448 3.9001 3.8574 3.9974 3.9685 4.0127 4.0621 4.0132 1.0241 1.0242 1.0552 1.0365 1.0101 1.0087 1.0066 1.0423 0.9904 0.9898 1.0088 1.0093 1.0005 1.0002 1.0032 1.0047
dispcorr: -0.016512959 hartree
energy: -1633.843808337429
dipole: -22.30179 20.71546 -1.58633 -3.26326 1.97086 -1.29240 8.38531 -7.22364 1.16167
magnitude: 2.35292 au
magnitude: 5.98064 debye
