program: Orca
programVersion: 5.0.2
elementType: O O O O N C C C C C C C C C C C C C C H H H H H H H H H H H H H H H H H H H H H
charge: 0
multiplicity: 1
keywords: wb97x-d3
keywords: def2-TZVPP
keywords: def2/J RIJCOSX
keywords: DEFGRID2
keywords: scfconv7
keywords: smallprint printgap noloewdin
keywords: NOSOSCF
formula: C14H21NO4
InChI: InChI=1/C14H21NO4/c1-5-17-12-8-7-11(9-13(12)18-6-2)15-14(16)19-10(3)4/h7-10,15H,5-6H2,1-4H3
40 atoms
O  -3.7073 -0.671786 0.19836
O  2.504003 1.720643 -0.378148
O  3.986301 -0.298698 0.175949
O  -2.37963 1.126035 -0.105138
N  -1.53156 -0.974138 0.212266
C  -0.145687 -0.766874 0.190382
C  1.836844 0.578285 -0.099312
C  -4.908643 0.116806 0.032857
C  2.65087 -0.533362 0.181577
C  0.455232 0.460693 -0.098953
C  0.658175 -1.863791 0.464731
C  2.042483 -1.745248 0.456599
C  -6.004831 -0.621738 0.769317
C  -5.217555 0.290192 -1.440621
C  -2.526253 -0.066182 0.08252
C  1.790199 2.943239 -0.532719
C  4.88774 -1.39562 0.266947
C  1.300425 3.516307 0.780473
C  4.981329 -2.194908 -1.015775
H  -4.757664 1.092437 0.499428
H  -0.155367 1.317884 -0.32662
H  0.212426 -2.825093 0.688965
H  2.629072 -2.626751 0.676253
H  -1.816867 -1.927691 0.387043
H  -6.930294 -0.050296 0.704465
H  -5.765665 -0.746115 1.825679
H  -6.189162 -1.605581 0.335155
H  -5.382166 -0.67421 -1.923629
H  -6.127228 0.880116 -1.554329
H  -4.42045 0.811567 -1.970264
H  0.969928 2.826747 -1.24677
H  2.509046 3.624178 -0.987507
H  4.634967 -2.037707 1.115913
H  5.852794 -0.942104 0.49171
H  0.836387 4.485097 0.593323
H  0.557076 2.885301 1.267178
H  2.127324 3.671004 1.473698
H  5.74593 -2.9640 -0.902456
H  4.047452 -2.695549 -1.27099
H  5.270294 -1.559186 -1.853085
elementType: O N C H
totalener: -901.91160704 hartree
nucrepener: 1461.39802007 hartree
electener: -2363.30962711 hartree
oneelecener: -4131.47534905 hartree
twoeener: 1768.16572194 hartree
cpcmener: -0.03537830 hartree
kineticenergy: 897.92832201 hartree
xcener: -86.303188408634 hartree
chargesum: -0.0000000
charge: -0.339486 -0.352319 -0.359390 -0.550138 -0.147603 0.077351 0.222727 0.164783 0.164676 -0.214273 -0.276093 -0.144108 -0.253660 -0.263252 0.548631 0.038927 0.039633 -0.261546 -0.259119 0.066474 0.148086 0.142824 0.145289 0.167747 0.091912 0.097477 0.089502 0.089339 0.097929 0.092175 0.086569 0.110834 0.084901 0.108174 0.095442 0.089499 0.088389 0.094383 0.089783 0.087528
qa: -0.3395 -0.3523 -0.3594 -0.5501 -0.1476 0.0774 0.2227 0.1648 0.1647 -0.2143 -0.2761 -0.1441 -0.2537 -0.2633 0.5486 0.0389 0.0396 -0.2615 -0.2591 0.0665 0.1481 0.1428 0.1453 0.1677 0.0919 0.0975 0.0895 0.0893 0.0979 0.0922 0.0866 0.1108 0.0849 0.1082 0.0954 0.0895 0.0884 0.0944 0.0898 0.0875
va: 2.0883 2.0442 2.0239 1.9442 3.2422 4.0028 3.9569 3.8191 3.9614 3.8585 3.9702 3.8437 3.9319 3.9074 4.2369 3.8765 3.8780 3.9102 3.9085 1.0230 1.0363 1.0073 1.0017 1.0237 1.0052 1.0079 1.0062 1.0071 1.0058 1.0178 0.9952 0.9913 0.9949 0.9920 1.0087 1.0042 1.0060 1.0089 1.0020 1.0063
dispcorr: -0.015712561 hartree
energy: -901.927319599304
dipole: -5.80559 4.99595 -0.80964 0.76238 -2.26181 -1.49943 -1.83242 2.02381 0.19139
magnitude: 1.71477 au
magnitude: 4.35860 debye
