program: Orca
programVersion: 5.0.2
elementType: O O O O N C C C C C C C C C C C C C C H H H H H H H H H H H H H H H H H H H H H
charge: 0
multiplicity: 1
keywords: wb97x-d3
keywords: def2-TZVPP
keywords: def2/J RIJCOSX
keywords: DEFGRID2
keywords: scfconv7
keywords: smallprint printgap noloewdin
keywords: NOSOSCF
formula: C14H21NO4
InChI: InChI=1/C14H21NO4/c1-5-17-12-8-7-11(9-13(12)18-6-2)15-14(16)19-10(3)4/h7-10,15H,5-6H2,1-4H3
40 atoms
O  -3.765219 -0.781962 -0.276339
O  2.394122 1.735729 0.235611
O  3.899454 -0.343213 0.383586
O  -2.461807 1.054712 -0.161901
N  -1.59571 -1.061087 -0.078021
C  -0.215822 -0.841398 0.030072
C  1.74898 0.550586 0.184264
C  -4.975055 0.009598 -0.335538
C  2.573106 -0.587713 0.249549
C  0.372102 0.425393 0.078351
C  0.597469 -1.963564 0.090279
C  1.977166 -1.835044 0.199955
C  -5.402207 0.416233 1.060122
C  -6.010237 -0.850489 -1.026945
C  -2.595977 -0.153831 -0.169228
C  1.629886 2.935882 0.198113
C  4.823623 -1.420825 0.283176
C  2.582371 4.101958 0.29061
C  5.029336 -1.894826 -1.139896
H  -4.784508 0.898462 -0.940791
H  -0.240476 1.309559 0.032867
H  0.162686 -2.954564 0.05116
H  2.569272 -2.738685 0.24504
H  -1.87085 -2.033457 -0.09821
H  -5.609377 -0.45867 1.677954
H  -6.315767 1.008058 1.00071
H  -4.649214 1.024588 1.560365
H  -6.231191 -1.752711 -0.454832
H  -6.935959 -0.284771 -1.129334
H  -5.687344 -1.141112 -2.026679
H  0.920087 2.956841 1.031308
H  1.053494 2.987051 -0.731237
H  4.53057 -2.247198 0.937809
H  5.757291 -1.020801 0.678144
H  3.283832 4.114923 -0.543425
H  2.012683 5.0302 0.261595
H  3.147536 4.085984 1.222302
H  5.367851 -1.079717 -1.77971
H  5.798564 -2.667662 -1.150151
H  4.127632 -2.322783 -1.577271
elementType: O N C H
totalener: -901.91387118 hartree
nucrepener: 1448.34573358 hartree
electener: -2350.25960475 hartree
oneelecener: -4105.34549160 hartree
twoeener: 1755.08588685 hartree
cpcmener: -0.03545315 hartree
kineticenergy: 897.92744648 hartree
xcener: -86.301563678735 hartree
chargesum: -0.0000000
charge: -0.339992 -0.341700 -0.360433 -0.550582 -0.145288 0.071775 0.243531 0.166258 0.154457 -0.217191 -0.277990 -0.138108 -0.263694 -0.252787 0.549095 0.052812 0.039459 -0.276524 -0.258501 0.065141 0.144388 0.142787 0.143635 0.167495 0.089262 0.097997 0.092742 0.089428 0.091943 0.096887 0.096700 0.096726 0.085311 0.108184 0.087844 0.090426 0.087369 0.087887 0.093953 0.089297
qa: -0.3400 -0.3417 -0.3604 -0.5506 -0.1453 0.0718 0.2435 0.1663 0.1545 -0.2172 -0.2780 -0.1381 -0.2637 -0.2528 0.5491 0.0528 0.0395 -0.2765 -0.2585 0.0651 0.1444 0.1428 0.1436 0.1675 0.0893 0.0980 0.0927 0.0894 0.0919 0.0969 0.0967 0.0967 0.0853 0.1082 0.0878 0.0904 0.0874 0.0879 0.0940 0.0893
va: 2.0879 2.0531 2.0232 1.9459 3.2420 4.0363 3.9690 3.8174 3.9684 3.8782 3.9722 3.8316 3.9071 3.9316 4.2358 3.8050 3.8788 3.9699 3.9090 1.0236 1.0474 1.0073 1.0023 1.0238 1.0069 1.0057 1.0177 1.0063 1.0051 1.0083 0.9863 0.9854 0.9948 0.9917 1.0031 1.0053 1.0032 1.0060 1.0090 1.0020
dispcorr: -0.015051693 hartree
energy: -901.928922869175
dipole: -3.43298 2.68632 -0.74666 2.47535 -3.99239 -1.51703 -1.62086 1.45992 -0.16094
magnitude: 1.69847 au
magnitude: 4.31717 debye
