program: Orca
programVersion: 5.0.2
elementType: O O O O N C C C C C C C C C C C C C C H H H H H H H H H H H H H H H H H H H H H
charge: 0
multiplicity: 1
keywords: wb97x-d3
keywords: def2-TZVPP
keywords: def2/J RIJCOSX
keywords: DEFGRID2
keywords: scfconv7
keywords: smallprint printgap noloewdin
keywords: NOSOSCF
formula: C14H21NO4
InChI: InChI=1/C14H21NO4/c1-5-17-12-8-7-11(9-13(12)18-6-2)15-14(16)19-10(3)4/h7-10,15H,5-6H2,1-4H3
40 atoms
O  -3.766695 -0.778285 -0.270737
O  2.388802 1.730962 0.231917
O  3.893815 -0.343629 0.3815
O  -2.460808 1.055553 -0.159444
N  -1.598588 -1.061746 -0.078486
C  -0.219048 -0.845389 0.030219
C  1.745767 0.548998 0.182393
C  -4.97472 0.011637 -0.331958
C  2.571439 -0.589434 0.249451
C  0.369203 0.42189 0.076114
C  0.594843 -1.966834 0.092696
C  1.975008 -1.83657 0.201999
C  -5.406669 0.41673 1.063115
C  -6.006651 -0.848513 -1.029189
C  -2.597225 -0.150104 -0.167594
C  1.629674 2.931505 0.195286
C  4.821847 -1.414609 0.282988
C  2.587189 4.093711 0.289081
C  5.034456 -1.887745 -1.13986
H  -4.783889 0.903037 -0.934191
H  -0.24658 1.304031 0.02748
H  0.162001 -2.959116 0.055423
H  2.567478 -2.740183 0.248736
H  -1.877603 -2.032679 -0.09782
H  -5.610915 -0.45824 1.682534
H  -6.322434 1.006057 1.004459
H  -4.656434 1.028506 1.564027
H  -6.228001 -1.75385 -0.461401
H  -6.934481 -0.286229 -1.135705
H  -5.678677 -1.136766 -2.028462
H  0.919019 2.956348 1.028503
H  1.052847 2.987672 -0.734278
H  4.534686 -2.243776 0.937876
H  5.753471 -1.009874 0.679629
H  3.289627 4.103707 -0.544698
H  2.023107 5.025988 0.26107
H  3.15295 4.07349 1.220796
H  5.371403 -1.07036 -1.778253
H  5.807152 -2.657839 -1.149712
H  4.136023 -2.318372 -1.582069
elementType: O N C H
totalener: -901.92094034 hartree
nucrepener: 1448.83124129 hartree
electener: -2350.75218163 hartree
oneelecener: -4106.12752187 hartree
twoeener: 1755.37534024 hartree
cpcmener: -0.02857811 hartree
kineticenergy: 897.93484387 hartree
xcener: -86.301082441925 hartree
chargesum: -0.0000000
charge: -0.335629 -0.322963 -0.341079 -0.521978 -0.150357 0.075077 0.241036 0.163119 0.149873 -0.217430 -0.278239 -0.139912 -0.263159 -0.250468 0.532593 0.050181 0.034463 -0.274597 -0.256715 0.064188 0.143713 0.136730 0.138907 0.162322 0.087894 0.095915 0.094245 0.088222 0.090348 0.095973 0.094214 0.094143 0.082185 0.106245 0.087166 0.088500 0.086773 0.088379 0.091889 0.088233
qa: -0.3356 -0.3230 -0.3411 -0.5220 -0.1504 0.0751 0.2410 0.1631 0.1499 -0.2174 -0.2782 -0.1399 -0.2632 -0.2505 0.5326 0.0502 0.0345 -0.2746 -0.2567 0.0642 0.1437 0.1367 0.1389 0.1623 0.0879 0.0959 0.0942 0.0882 0.0903 0.0960 0.0942 0.0941 0.0822 0.1062 0.0872 0.0885 0.0868 0.0884 0.0919 0.0882
va: 2.0883 2.0740 2.0455 1.9811 3.2358 4.0379 3.9747 3.8273 3.9812 3.8774 3.9808 3.8379 3.9066 3.9312 4.2570 3.8127 3.8882 3.9711 3.9082 1.0238 1.0486 1.0090 1.0035 1.0272 1.0072 1.0061 1.0176 1.0066 1.0056 1.0085 0.9862 0.9852 0.9945 0.9919 1.0034 1.0056 1.0035 1.0059 1.0094 1.0025
dispcorr: -0.015061731 hartree
energy: -901.936002070671
dipole: -3.38743 2.71057 -0.67686 2.48967 -3.84700 -1.35734 -1.62786 1.47405 -0.15381
magnitude: 1.52452 au
magnitude: 3.87502 debye
