program: Orca
programVersion: 5.0.2
elementType: O O O O N C C C C C C C C C C C C C C H H H H H H H H H H H H H H H H H H H H H
charge: 0
multiplicity: 1
keywords: wb97x-d3
keywords: def2-TZVPP
keywords: def2/J RIJCOSX
keywords: DEFGRID2
keywords: scfconv7
keywords: smallprint printgap noloewdin
keywords: NOSOSCF
formula: C14H21NO4
InChI: InChI=1/C14H21NO4/c1-5-17-12-8-7-11(9-13(12)18-6-2)15-14(16)19-10(3)4/h7-10,15H,5-6H2,1-4H3
40 atoms
O  -3.788048 -0.696891 -0.212536
O  2.468862 1.645567 -0.226363
O  3.900445 -0.463304 0.029238
O  -2.436706 1.103615 -0.325611
N  -1.623532 -1.018035 -0.052875
C  -0.234845 -0.837515 -0.027017
C  1.774714 0.497799 -0.107674
C  -4.979678 0.110333 -0.327414
C  2.564659 -0.659389 0.02706
C  0.391706 0.408228 -0.135649
C  0.544764 -1.975707 0.115425
C  1.932011 -1.88392 0.14094
C  -5.367738 0.664793 1.028533
C  -6.044495 -0.794272 -0.909039
C  -2.600656 -0.092438 -0.206535
C  1.792188 2.895512 -0.259483
C  4.750375 -1.597477 0.092568
C  1.316016 3.348584 1.104428
C  6.178423 -1.116275 0.019563
H  -4.78722 0.930871 -1.022134
H  -0.20387 1.299206 -0.244651
H  0.079708 -2.949767 0.207477
H  2.502629 -2.796059 0.251805
H  -1.930898 -1.976814 0.03232
H  -6.271216 1.268173 0.932101
H  -4.591694 1.305021 1.44836
H  -5.57581 -0.137556 1.738727
H  -5.747078 -1.190316 -1.880731
H  -6.268658 -1.632053 -0.246458
H  -6.964439 -0.227074 -1.052176
H  0.97112 2.876887 -0.982603
H  2.532237 3.5982 -0.643332
H  4.536172 -2.280061 -0.737627
H  4.581641 -2.149041 1.024361
H  0.878928 4.344325 1.017614
H  0.555602 2.692658 1.528901
H  2.146554 3.41029 1.808614
H  6.376451 -0.589828 -0.914781
H  6.421908 -0.452833 0.850089
H  6.852001 -1.972104 0.068655
elementType: O N C H
totalener: -901.92087088 hartree
nucrepener: 1452.47214665 hartree
electener: -2354.39301753 hartree
oneelecener: -4113.41245532 hartree
twoeener: 1759.01943780 hartree
cpcmener: -0.02828125 hartree
kineticenergy: 897.93825028 hartree
xcener: -86.301524434802 hartree
chargesum: 0.0000000
charge: -0.335877 -0.333070 -0.330020 -0.521873 -0.151464 0.074496 0.212891 0.162077 0.186142 -0.210372 -0.273985 -0.159146 -0.263320 -0.251788 0.532027 0.034288 0.051265 -0.261253 -0.272053 0.065292 0.148020 0.136373 0.137868 0.162549 0.096047 0.094169 0.087907 0.096219 0.088537 0.090305 0.084962 0.108626 0.090463 0.089823 0.092821 0.090817 0.088379 0.086677 0.087273 0.087907
qa: -0.3359 -0.3331 -0.3300 -0.5219 -0.1515 0.0745 0.2129 0.1621 0.1861 -0.2104 -0.2740 -0.1591 -0.2633 -0.2518 0.5320 0.0343 0.0513 -0.2613 -0.2721 0.0653 0.1480 0.1364 0.1379 0.1625 0.0960 0.0942 0.0879 0.0962 0.0885 0.0903 0.0850 0.1086 0.0905 0.0898 0.0928 0.0908 0.0884 0.0867 0.0873 0.0879
va: 2.0872 2.0653 2.0554 1.9808 3.2360 4.0176 3.9750 3.8277 3.9791 3.8557 3.9881 3.8734 3.9068 3.9315 4.2581 3.8843 3.8226 3.9104 3.9734 1.0232 1.0372 1.0095 1.0084 1.0273 1.0062 1.0176 1.0071 1.0085 1.0065 1.0056 0.9958 0.9912 0.9867 0.9846 1.0092 1.0031 1.0056 1.0038 1.0035 1.0062
dispcorr: -0.015184660 hartree
energy: -901.936055535456
dipole: -3.66137 2.91439 -0.74698 3.02113 -4.29576 -1.27463 3.17019 -2.97655 0.19363
magnitude: 1.49002 au
magnitude: 3.78733 debye
