program: Orca
programVersion: 5.0.2
elementType: O O O O N C C C C C C C C C C C C C C H H H H H H H H H H H H H H H H H H H H H
charge: 0
multiplicity: 1
keywords: wb97x-d3
keywords: def2-TZVPP
keywords: def2/J RIJCOSX
keywords: DEFGRID2
keywords: scfconv7
keywords: smallprint printgap noloewdin
keywords: NOSOSCF
formula: C14H21NO4
InChI: InChI=1/C14H21NO4/c1-5-17-12-8-7-11(9-13(12)18-6-2)15-14(16)19-10(3)4/h7-10,15H,5-6H2,1-4H3
40 atoms
O  -3.849264 -0.721319 -0.187507
O  2.406287 1.553161 -0.141812
O  3.855725 -0.730377 -0.35581
O  -2.477902 1.063963 -0.057479
N  -1.684456 -1.080645 -0.216986
C  -0.294189 -0.923311 -0.230464
C  1.724914 0.39461 -0.189481
C  -5.018897 0.110173 -0.128284
C  2.502632 -0.769318 -0.280009
C  0.337727 0.317679 -0.158059
C  0.474096 -2.077059 -0.32753
C  1.856887 -1.989394 -0.342911
C  -5.327413 0.493292 1.307392
C  -6.137224 -0.689851 -0.765969
C  -2.650937 -0.125589 -0.143926
C  1.698063 2.772598 -0.066881
C  4.570709 -0.25797 0.779248
C  2.710794 3.893165 -0.022159
C  5.90832 -0.962807 0.822517
H  -4.838636 1.015323 -0.713721
H  -0.260063 1.211272 -0.090158
H  0.001254 -3.05024 -0.386463
H  2.455629 -2.887462 -0.422927
H  -2.014134 -2.028723 -0.291624
H  -5.490573 -0.392987 1.922488
H  -6.23553 1.095866 1.342922
H  -4.523998 1.081579 1.747126
H  -7.052637 -0.098734 -0.778809
H  -5.89907 -0.958386 -1.794994
H  -6.339955 -1.606113 -0.209946
H  1.064326 2.795988 0.827475
H  1.039313 2.8867 -0.935522
H  4.007207 -0.458806 1.697294
H  4.715553 0.823498 0.715008
H  3.356492 3.808302 0.851644
H  3.337333 3.895162 -0.913384
H  2.197388 4.85277 0.031661
H  6.503585 -0.584466 1.654007
H  5.788144 -2.037991 0.95455
H  6.471256 -0.793377 -0.09523
totalener: -901.90069235 hartree
nucrepener: 1450.02300403 hartree
electener: -2351.92369638 hartree
oneelecener: -4107.46080645 hartree
twoeener: 1755.53711007 hartree
kineticenergy: 897.98553947 hartree
xcener: -86.300595579127 hartree
chargesum: -0.0000000
charge: -0.325077 -0.291211 -0.325069 -0.434082 -0.168259 0.110625 0.344140 0.145972 0.023147 -0.223816 -0.222962 -0.095055 -0.257918 -0.229507 0.494371 0.034546 0.071923 -0.264538 -0.240736 0.062934 0.148488 0.088004 0.111702 0.132174 0.080578 0.081324 0.104878 0.078212 0.091927 0.081447 0.082020 0.086358 0.062884 0.073497 0.080737 0.089103 0.083043 0.073573 0.075740 0.084882
qa: -0.3251 -0.2912 -0.3251 -0.4341 -0.1683 0.1106 0.3441 0.1460 0.0231 -0.2238 -0.2230 -0.0951 -0.2579 -0.2295 0.4944 0.0345 0.0719 -0.2645 -0.2407 0.0629 0.1485 0.0880 0.1117 0.1322 0.0806 0.0813 0.1049 0.0782 0.0919 0.0814 0.0820 0.0864 0.0629 0.0735 0.0807 0.0891 0.0830 0.0736 0.0757 0.0849
va: 2.0860 2.1164 2.0542 2.0708 3.2341 4.0587 3.7520 3.8684 4.0305 3.9152 4.0147 4.0699 3.9041 3.9273 4.2755 3.8587 3.8455 3.9695 3.9839 1.0231 1.0435 1.0183 1.0158 1.0485 1.0090 1.0094 1.0186 1.0085 1.0107 1.0090 0.9860 0.9862 0.9941 0.9911 1.0047 1.0047 1.0080 1.0089 1.0075 1.0052
dispcorr: -0.015430288 hartree
energy: -901.916122637007
dipole: -1.76348 0.99872 -0.76476 6.98715 -7.10717 -0.12002 5.28035 -4.87724 0.40311
magnitude: 0.87279 au
magnitude: 2.21846 debye
