program: Orca
programVersion: 5.0.2
elementType: O O O O N C C C C C C C C C C C C C C H H H H H H H H H H H H H H H H H H H H H
charge: 0
multiplicity: 1
keywords: wb97x-d3
keywords: def2-TZVPP
keywords: def2/J RIJCOSX
keywords: DEFGRID2
keywords: scfconv7
keywords: smallprint printgap noloewdin
keywords: NOSOSCF
formula: C14H21NO4
InChI: InChI=1/C14H21NO4/c1-5-17-12-8-7-11(9-13(12)18-6-2)15-14(16)19-10(3)4/h7-10,15H,5-6H2,1-4H3
40 atoms
O  -3.819976 -0.749165 -0.214961
O  2.286922 1.725332 0.18025
O  3.888785 -0.514282 -0.269326
O  -2.502187 1.060087 0.068571
N  -1.646068 -1.03279 -0.300398
C  -0.263554 -0.83026 -0.276705
C  1.724467 0.509473 -0.046936
C  -5.011335 0.024073 -0.001177
C  2.5331 -0.611598 -0.244929
C  0.340605 0.405521 -0.061165
C  0.54259 -1.947763 -0.486465
C  1.920448 -1.836027 -0.46361
C  -5.26447 0.201426 1.484705
C  -6.131699 -0.724574 -0.694681
C  -2.641431 -0.119832 -0.127165
C  2.697224 2.417528 -0.993384
C  4.525838 -0.331013 0.990427
C  3.339643 3.718848 -0.576313
C  4.394435 -1.533356 1.904359
H  -4.885201 1.004763 -0.46672
H  -0.246692 1.29505 0.104815
H  0.093632 -2.918726 -0.661153
H  2.538051 -2.709651 -0.627064
H  -1.946514 -1.980454 -0.458364
H  -6.188312 0.759638 1.639408
H  -4.460759 0.756684 1.965469
H  -5.370084 -0.763975 1.981944
H  -6.278942 -1.714344 -0.260361
H  -7.065175 -0.172275 -0.588804
H  -5.933466 -0.842762 -1.759802
H  1.827799 2.607434 -1.633776
H  3.402811 1.810569 -1.569602
H  4.14789 0.566361 1.487797
H  5.575631 -0.154179 0.752079
H  2.647101 4.337048 -0.005888
H  4.225465 3.543902 0.033799
H  3.645655 4.28126 -1.458168
H  3.359458 -1.711541 2.197013
H  4.776806 -2.437598 1.429789
H  4.968902 -1.36477 2.81607
totalener: -901.89723368 hartree
nucrepener: 1458.89638843 hartree
electener: -2360.79362212 hartree
oneelecener: -4125.28818401 hartree
twoeener: 1764.49456189 hartree
kineticenergy: 897.99449499 hartree
xcener: -86.298144835626 hartree
chargesum: 0.0000000
charge: -0.326059 -0.344242 -0.339747 -0.421016 -0.174516 0.185702 0.238261 0.142745 0.105157 -0.232028 -0.182640 -0.140538 -0.256206 -0.230106 0.489107 0.040002 0.046070 -0.237881 -0.262518 0.065746 0.148473 0.092026 0.115129 0.132059 0.081330 0.105374 0.080328 0.081252 0.078389 0.092076 0.080990 0.084772 0.074777 0.087485 0.085112 0.080062 0.075412 0.091814 0.081098 0.086753
qa: -0.3261 -0.3442 -0.3397 -0.4210 -0.1745 0.1857 0.2383 0.1427 0.1052 -0.2320 -0.1826 -0.1405 -0.2562 -0.2301 0.4891 0.0400 0.0461 -0.2379 -0.2625 0.0657 0.1485 0.0920 0.1151 0.1321 0.0813 0.1054 0.0803 0.0813 0.0784 0.0921 0.0810 0.0848 0.0748 0.0875 0.0851 0.0801 0.0754 0.0918 0.0811 0.0868
va: 2.0848 1.9849 2.0063 2.0828 3.2294 3.8857 3.8608 3.8706 3.9702 4.0886 3.9846 4.0804 3.9048 3.9266 4.2858 3.8537 3.8761 3.9658 3.9182 1.0224 1.0406 1.0166 1.0144 1.0494 1.0094 1.0179 1.0091 1.0090 1.0086 1.0104 0.9916 0.9936 1.0032 0.9924 1.0060 1.0038 1.0090 0.9980 1.0070 1.0143
dispcorr: -0.016415271 hartree
energy: -901.913648955041
dipole: -1.54321 1.07720 -0.46601 3.49075 -4.19541 -0.70466 4.47092 -4.50324 -0.03231
magnitude: 0.84543 au
magnitude: 2.14891 debye
