program: Orca
programVersion: 5.0.2
elementType: O O O O N C C C C C C C C C C C C C C H H H H H H H H H H H H H H H H H H H H H
charge: 0
multiplicity: 1
keywords: wb97x-d3
keywords: def2-TZVPP
keywords: def2/J RIJCOSX
keywords: DEFGRID2
keywords: scfconv7
keywords: smallprint printgap noloewdin
keywords: NOSOSCF
formula: C14H21NO4
InChI: InChI=1/C14H21NO4/c1-5-17-12-8-7-11(9-13(12)18-6-2)15-14(16)19-10(3)4/h7-10,15H,5-6H2,1-4H3
40 atoms
O  -3.918409 0.143166 0.134547
O  2.72923 1.7259 0.782321
O  3.737481 -0.65434 -0.343113
O  -2.759133 -1.635118 -0.626327
N  -1.725263 0.259857 0.141424
C  -0.366788 -0.032055 -0.01107
C  1.904649 0.756541 0.310141
C  -5.172682 -0.509776 -0.119599
C  2.399082 -0.435026 -0.22637
C  0.535418 0.943425 0.411086
C  0.12569 -1.212117 -0.562399
C  1.496443 -1.393903 -0.655087
C  -6.198165 0.593914 -0.283013
C  -5.516835 -1.457971 1.013974
C  -2.796772 -0.524864 -0.161782
C  3.492525 2.443684 -0.18337
C  4.373394 -1.086915 0.853001
C  2.636522 3.253087 -1.136432
C  5.846221 -1.265212 0.570658
H  -5.094388 -1.074583 -1.05197
H  0.181852 1.875356 0.838463
H  -0.54032 -1.984837 -0.907473
H  1.881954 -2.312081 -1.080131
H  -1.940607 1.162937 0.530572
H  -7.172013 0.161417 -0.511832
H  -5.932789 1.267378 -1.097745
H  -6.300531 1.182329 0.62982
H  -6.483816 -1.92516 0.8246
H  -4.780294 -2.254012 1.109311
H  -5.583917 -0.925781 1.964088
H  4.146627 1.769002 -0.741023
H  4.129548 3.106274 0.403655
H  3.930688 -2.032669 1.187932
H  4.223956 -0.356321 1.654487
H  2.01073 2.616116 -1.76171
H  1.990482 3.949083 -0.600634
H  3.278719 3.834084 -1.799586
H  6.357923 -1.605963 1.470917
H  6.013242 -2.005023 -0.211965
H  6.305735 -0.327311 0.258441
totalener: -901.89739404 hartree
nucrepener: 1450.39450172 hartree
electener: -2352.29189577 hartree
oneelecener: -4108.16325140 hartree
twoeener: 1755.87135563 hartree
kineticenergy: 897.99222406 hartree
xcener: -86.298117595892 hartree
chargesum: 0.0000000
charge: -0.326071 -0.336649 -0.353310 -0.421958 -0.175587 0.191105 0.129549 0.144617 0.182688 -0.202031 -0.183721 -0.140934 -0.230208 -0.256527 0.491501 0.044247 0.038467 -0.261307 -0.236434 0.064032 0.084972 0.149987 0.120117 0.132844 0.078904 0.091489 0.081234 0.081637 0.105542 0.080235 0.076212 0.089822 0.078473 0.085782 0.093845 0.080137 0.087973 0.076444 0.083219 0.079663
qa: -0.3261 -0.3366 -0.3533 -0.4220 -0.1756 0.1911 0.1295 0.1446 0.1827 -0.2020 -0.1837 -0.1409 -0.2302 -0.2565 0.4915 0.0442 0.0385 -0.2613 -0.2364 0.0640 0.0850 0.1500 0.1201 0.1328 0.0789 0.0915 0.0812 0.0816 0.1055 0.0802 0.0762 0.0898 0.0785 0.0858 0.0938 0.0801 0.0880 0.0764 0.0832 0.0797
va: 2.0841 2.0098 1.9784 2.0813 3.2267 3.8921 4.0771 3.8703 3.8368 4.0712 3.9790 4.0548 3.9272 3.9046 4.2810 3.8759 3.8515 3.9196 3.9652 1.0231 1.0330 1.0325 1.0111 1.0494 1.0086 1.0107 1.0089 1.0093 1.0181 1.0088 1.0035 0.9913 0.9928 0.9927 0.9980 1.0072 1.0141 1.0091 1.0060 1.0039
dispcorr: -0.016413878 hartree
energy: -901.913807921929
dipole: 0.11147 -0.38651 -0.27504 3.71715 -2.94920 0.76795 1.03292 -0.72763 0.30529
magnitude: 0.87097 au
magnitude: 2.21384 debye
