program: Gaussian 09
title: 000066031
version: EM64L-G09RevD.01
frameworkgroup: C1[X(C9H9NO)]
method: RPBEPBE
basis: SDD
operation: Freq
keyword: #pfreq=noraman
keyword: PBEPBE/SDD
title: #p freq=noraman PBEPBE/SDD
converged: YES YES NO NO
title: Mulliken charges:
elementType: O N C C C C C C C C C H H H H H H H H H
charge: -0.264677 -0.016648 0.459770 -0.349569 -0.375153 0.324942 -0.344829 -0.345041 -0.596143 -0.538136 -0.123430 0.237015 0.232820 0.253660 0.243047 0.254681 0.255013 0.221119 0.223756 0.247803
chargesum: 0.00000
title: Mulliken charges with hydrogens summed into heavy atoms:
elementType: O N C C C C C C C C C
charge: -0.264677 -0.016648 0.459770 -0.112554 -0.142333 0.324942 -0.091169 -0.101994 -0.086449 0.154542 -0.123430
polarizability: 1.46134267e+02 -1.96253825e+00 9.29686145e+01 1.94935774e+00 2.61195299e+00 6.67695901e+01
1716.lowfreq: -12.8224 -0.0008 -0.0006 -0.0004 7.0492 7.3766 9.9985 61.6824 106.7524
frequency: -11.5127 61.6741 106.7475 170.2863 208.7308 234.6502 315.5503 339.6956 353.1219 379.6799 413.9659 472.0305 507.1328 571.1598 632.1255 702.9907 747.8771 805.3647 818.7834 841.7311 908.6980 918.8249 944.6726 963.9621 988.2016 1002.6710 1112.7247 1113.4674 1157.0373 1179.8416 1185.4256 1205.9317 1234.3406 1293.8296 1307.8469 1384.8775 1419.8231 1437.5674 1447.6761 1467.3649 1472.5129 1503.5308 1587.5315 1624.9067 2193.1135 2959.1589 2997.2149 3046.8572 3051.4154 3125.8488 3127.9060 3131.0572 3165.8240 3170.4647
redmass: 4.4265 5.4519 4.2442 3.8056 2.9604 1.2225 2.7568 5.8453 3.5523 6.1351 2.9312 4.4176 3.0892 4.1927 6.7233 3.7584 4.3036 2.7757 1.4661 1.9377 1.8278 3.2085 1.5715 1.3681 8.5620 2.7220 1.3057 1.3008 1.3391 1.2093 1.1298 2.2741 3.8714 1.4770 1.2995 5.2549 3.3502 1.1719 1.0850 1.0499 1.0724 2.4575 7.0241 6.4244 12.4153 1.0332 1.0591 1.1040 1.1006 1.0907 1.0982 1.0899 1.0938 1.0955
irintensity: 3.6508 2.4233 6.6053 2.4220 4.1207 0.0698 1.6926 4.3224 0.0295 1.8991 0.0301 1.7648 16.5382 22.6616 0.4585 4.9941 4.4454 33.3544 1.7905 50.4796 0.0954 0.8466 0.0266 0.1947 39.7113 6.4568 6.5644 6.0813 0.7461 39.7175 16.4930 0.7102 180.9508 1.1755 0.4345 8.1428 1.9121 11.1925 23.6389 14.0448 51.2235 107.8044 9.0408 51.5615 11.0687 62.1355 11.8201 48.0292 2.9021 22.7635 13.8265 11.7183 12.9886 2.9869
temp: 298.150 k
press: 1.00000 atm
elementType: 8 7 6 6 6 6 6 6 6 6 6 1 1 1 1 1 1 1 1 1
symmnumber: 1
zpe: 409813.2 jmol-1
zpe.correction: 0.156090 hartree
zpe.thermalcorrener: 0.165556 hartree
zpe.thermalcorrenthalpy: 0.166500 hartree
zpe.thermalcorrgfe: 0.121083 hartree
zpe.sumelectzpe: -477.508348 hartree
zpe.sumelectthermal: -477.498882 hartree
zpe.sumelectthermalent: -477.497938 hartree
zpe.sumelectthermalfe: -477.543354 hartree
dipole: 3.4808 -0.9579 -3.0991
dipole: 4.7580
quadrupole: -69.7568 -58.2553 -69.8121
quadrupole: -9.0999 13.7435 1.6045
quadrupole: -3.8154 7.6861 -3.8707 -9.0999 13.7435 1.6045
hfenergy: -477.6644377 hartree
pointgroup: C01 [X(C9H9N1O1)]
dipole: 1.3920786 -0.3217909 -1.2094119 debye
dipolederiv: -1.6984976 0.2854924 -0.2105124 0.1689446 -0.360192 0.0230928 -0.2899254 0.0550035 -0.3441383 -0.3138836 -0.0041448 0.0074387 -0.0396412 -0.2321065 0.0005613 0.1642158 0.0042639 -0.2313919 0.1758105 0.0461786 0.0010767 0.0002336 -0.1563786 -0.0065362 -0.0050579 0.0101175 -0.1564375 0.0751445 0.0164845 0.0690534 0.0089939 0.1174048 0.0497336 0.0569168 0.0749093 -0.1110314 0.0702751 -0.0882776 0.0414355 -0.0061048 0.1218247 0.0655154 0.0536131 0.0201175 -0.114566 1.5181925 -0.1296463 0.2613004 0.1256233 0.0221687 0.0070722 0.3631479 -0.0474766 0.1667207 -0.3736037 0.0199367 -0.0254473 0.2591054 0.0163769 0.0910481 0.0115769 0.0456366 -0.146509 -0.3509462 0.0343095 -0.0074962 -0.3070655 -0.0221212 -0.0238619 -0.0993923 0.0452118 -0.1989427 0.1902854 -0.0247788 0.0759923 -0.0146426 0.2172019 0.0233705 0.0715077 0.02072 0.131464 0.6168566 -0.1653193 0.0192913 -0.4909324 0.429687 -0.0729492 -0.0357967 -0.0154906 0.3146053 -0.0573152 0.0310343 -0.1357414 0.0474349 -0.0403064 -0.033603 -0.2349286 -0.0358713 0.0805859 0.0224018 0.1110507 -0.0137905 0.0986839 -0.0307286 -0.0216402 -0.0075178 -0.0138632 0.136279 0.0412671 -0.0797257 -0.0524121 -0.0819848 -0.0386263 -0.0538078 -0.0432211 -0.0572644 0.1192146 0.0577367 -0.06447 -0.0352153 -0.0601729 -0.0034881 -0.0496458 -0.0434741 -0.0513265 0.150006 0.020664 0.0933788 -0.0073381 0.105524 -0.0197143 -0.0200814 -0.0151626 -0.0214998 0.1602497 0.0292345 -0.0140563 0.0169318 -0.0668486 0.0206416 -0.1039419 -0.0043254 -0.0448636 0.0188629 0.0184977 0.016858 0.0092523 0.0679333 -0.0224299 0.0852629 0.0153279 0.0267404 0.0724052 0.0583087 0.0042074 -0.03234 0.1452371 -0.0081282 -0.0566309 0.0687354 -0.0966816 -0.1348951 0.0315179 -0.0715761 0.0798689 0.1010183 -0.0905637 0.1211075 0.0477357 0.0954738 -0.0174495 -0.1319468 -0.0169358 -0.0613479 -0.0613394 0.0794782 -0.0240659 -0.0739753 -0.0138566 0.1049682 unknown
polarizability: 145.7914873|-3.9283831|92.5751307|3.9881856|4.4991508|67.5058541 unknown
InChI: InChI=1S/C9H9NO/c1-11-9-4-2-8(3-5-9)6-7-10/h2-5H,6H2,1H3
charge 0 multiplicity 1
20 atoms
O  3.135567 0.324638 0.433079
N  -4.011063 -0.415035 1.206572
C  -0.978686 0.136426 -0.573219
C  -0.354199 1.341588 -0.158693
C  -0.197822 -1.038611 -0.648786
C  1.78466 0.185054 0.086969
C  1.012893 1.372219 0.168124
C  1.177624 -1.028203 -0.32398
C  -2.470978 0.108863 -0.914738
C  3.978449 -0.872356 0.378839
C  -3.326984 -0.179067 0.257199
H  -0.94253 2.264242 -0.087584
H  -0.663516 -1.981212 -0.9614
H  1.504095 2.296269 0.487098
H  1.755033 -1.954672 -0.3937
H  -2.679662 -0.658065 -1.684241
H  -2.790385 1.079491 -1.338779
H  4.027208 -1.285084 -0.647903
H  3.614961 -1.652866 1.075514
H  4.977335 -0.533817 0.689828
