program: Orca
programVersion: 5.0.2
elementType: O O O O N C C C C C C C C C C C C C C H H H H H H H H H H H H H H H H H H H H H
charge: 0
multiplicity: 1
keywords: wb97x-d3
keywords: def2-TZVPP
keywords: def2/J RIJCOSX
keywords: DEFGRID2
keywords: scfconv7
keywords: smallprint printgap noloewdin
keywords: NOSOSCF
formula: C14H21NO4
InChI: InChI=1/C14H21NO4/c1-5-17-12-8-7-11(9-13(12)18-6-2)15-14(16)19-10(3)4/h7-10,15H,5-6H2,1-4H3
40 atoms
O  -3.744677 -0.61752 0.225203
O  2.376242 1.752046 -0.420566
O  3.963536 -0.456406 0.237592
O  -2.407486 1.077928 -0.429862
N  -1.576746 -0.885428 0.41279
C  -0.191887 -0.709023 0.349208
C  1.809574 0.576442 -0.043457
C  -4.929883 0.098812 -0.155776
C  2.605524 -0.530292 0.265434
C  0.424095 0.487869 -0.006489
C  0.602516 -1.80402 0.684203
C  1.981116 -1.711441 0.636546
C  -6.056102 -0.471741 0.683237
C  -5.181324 -0.053554 -1.644864
C  -2.560242 -0.028222 0.02061
C  2.945852 2.529341 0.628872
C  4.552645 -0.494982 -1.058253
C  1.9029 3.140986 1.543168
C  4.433501 -1.850788 -1.725675
H  -4.796908 1.157025 0.082671
H  -0.15491 1.359837 -0.267067
H  0.14419 -2.743262 0.97174
H  2.591187 -2.568471 0.891202
H  -1.888893 -1.779548 0.753921
H  -5.86098 -0.350802 1.748565
H  -6.206983 -1.532754 0.479709
H  -6.986682 0.047206 0.454091
H  -6.100102 0.464718 -1.921129
H  -4.372495 0.375053 -2.234465
H  -5.295531 -1.103845 -1.917548
H  3.510871 3.314549 0.125134
H  3.658511 1.934347 1.207063
H  5.602809 -0.245651 -0.901045
H  4.125071 0.281574 -1.6987
H  1.341821 2.381899 2.088212
H  2.391559 3.780895 2.279183
H  1.194267 3.752116 0.984249
H  4.870565 -2.63695 -1.109579
H  3.395809 -2.113235 -1.932554
H  4.964267 -1.838271 -2.678572
totalener: -901.89602096 hartree
nucrepener: 1469.96195458 hartree
electener: -2371.85797554 hartree
oneelecener: -4147.45025145 hartree
twoeener: 1775.59227590 hartree
kineticenergy: 897.98685117 hartree
xcener: -86.298138173315 hartree
chargesum: -0.0000000
charge: -0.325959 -0.339761 -0.347139 -0.419557 -0.174979 0.195581 0.216654 0.142197 0.145142 -0.250322 -0.176002 -0.162263 -0.229203 -0.256520 0.488493 0.042356 0.045839 -0.256791 -0.262458 0.064845 0.150185 0.092364 0.117885 0.131874 0.091647 0.080854 0.078567 0.081744 0.106225 0.080262 0.086930 0.075420 0.086269 0.077779 0.090083 0.085632 0.086650 0.081431 0.091163 0.086883
qa: -0.3260 -0.3398 -0.3471 -0.4196 -0.1750 0.1956 0.2167 0.1422 0.1451 -0.2503 -0.1760 -0.1623 -0.2292 -0.2565 0.4885 0.0424 0.0458 -0.2568 -0.2625 0.0648 0.1502 0.0924 0.1179 0.1319 0.0916 0.0809 0.0786 0.0817 0.1062 0.0803 0.0869 0.0754 0.0863 0.0778 0.0901 0.0856 0.0867 0.0814 0.0912 0.0869
va: 2.0840 2.0021 1.9976 2.0855 3.2280 3.8751 3.8802 3.8720 3.8968 4.0472 3.9832 4.0888 3.9270 3.9051 4.2881 3.8800 3.8781 3.9176 3.9165 1.0228 1.0393 1.0165 1.0123 1.0493 1.0106 1.0092 1.0084 1.0095 1.0175 1.0089 0.9930 1.0018 0.9931 1.0015 0.9986 1.0132 1.0073 1.0069 0.9979 1.0144
dispcorr: -0.016926085 hartree
energy: -901.912947048432
dipole: -4.01598 3.53721 -0.47877 1.26193 -1.98049 -0.71856 -2.37049 2.60102 0.23053
magnitude: 0.89370 au
magnitude: 2.27160 debye
