program: Orca
programVersion: 4.2.1
elementType: O O N N N C C C C C C C C C H H H H H H H H H
charge: 0
multiplicity: 1
keywords: wb97x-d3
keywords: def2-TZVPP
keywords: def2/J RIJCOSX GRIDX6 NOFINALGRIDX
keywords: grid4 nofinalgrid
keywords: scfconv7
keywords: smallprint printgap noloewdin
keywords: NOSOSCF
formula: C9H9N3O2
InChI: InChI=1/C9H9N3O2/c1-14-9(13)12-8-10-6-4-2-3-5-7(6)11-8/h2-5,10-11H,1H3
23 atoms
O  3.797426 0.525364 -0.00097
O  2.453207 -1.263848 -0.000631
N  -0.187089 -0.703124 0.001204
N  -0.641098 1.419879 0.00077
N  1.630826 0.905937 -0.000999
C  -1.562602 -0.597731 0.001244
C  -1.854446 0.766492 0.000768
C  0.375452 0.527512 0.000198
C  -2.561794 -1.553058 0.00093
C  -3.158206 1.227597 0.000142
C  -3.87332 -1.093979 0.000269
C  -4.165453 0.270281 -0.000042
C  2.584784 -0.044534 -0.001252
C  4.922785 -0.343832 -0.000284
H  0.363048 -1.549198 0.001616
H  -2.332726 -2.609839 0.000377
H  -3.38424 2.285025 0.000249
H  -4.683263 -1.81057 -0.000743
H  -5.197956 0.592001 -0.000585
H  5.798308 0.300406 0.002739
H  4.953379 -0.974139 -0.889726
H  4.949637 -0.976926 0.887241
H  -0.499847 2.418287 -0.002171
elementType: O N C H
totalener: -663.20535249 hartree
nucrepener: 846.95141712 hartree
electener: -1510.15676961 hartree
oneelecener: -2581.88073336 hartree
twoeener: 1071.72396375 hartree
cpcmener: -0.03343392 hartree
kineticenergy: 660.48263744 hartree
xcener: -62.569971025419 hartree
chargesum: 0.0000000
charge: -0.327362 -0.575715 -0.145243 -0.113383 -0.482461 0.076030 0.106097 0.358329 -0.191002 -0.200494 -0.154841 -0.147009 0.535705 -0.120783 0.202795 0.157789 0.157264 0.161041 0.161775 0.125437 0.110919 0.110248 0.194863
qa: -0.3274 -0.5757 -0.1452 -0.1134 -0.4825 0.0760 0.1061 0.3583 -0.1910 -0.2005 -0.1548 -0.1470 0.5357 -0.1208 0.2028 0.1578 0.1573 0.1610 0.1618 0.1254 0.1109 0.1102 0.1949
va: 2.0464 1.8980 3.3912 3.3845 2.9193 3.8292 3.7933 4.2248 3.9607 3.9682 3.8737 3.8697 4.2942 3.8750 1.0244 0.9984 0.9992 0.9898 0.9892 0.9963 0.9943 0.9945 1.0044
dispcorr: -0.007194412 hartree
energy: -663.212546906766
dipole: 0.08319 -1.91164 -1.82845 -2.11509 2.32605 0.21096 -0.00143 0.00049 -0.00095
magnitude: 1.84058 au
magnitude: 4.67839 debye
