program: Gaussian 09
title: 000066030
version: EM64L-G09RevD.01
frameworkgroup: C1[X(C18H30O)]
method: RPBEPBE
basis: SDD
operation: Freq
keyword: #pfreq=noraman
keyword: PBEPBE/SDD
title: #p freq=noraman PBEPBE/SDD
converged: YES YES NO NO
title: Mulliken charges:
elementType: O C C C C C C C C C C C C C C C C C C H H H H H H H H H H H H H H H H H H H H H H H H H H H H H H
charge: -0.437664 -0.385137 -0.385587 -0.384972 -0.387973 -0.381710 -0.366659 -0.372747 -0.387366 -0.353207 -0.572127 -0.356675 0.517622 -0.696737 -0.384636 -0.403359 -0.351843 -0.387287 0.276694 0.194702 0.192590 0.192476 0.194587 0.193696 0.191981 0.196175 0.194157 0.191058 0.192635 0.191010 0.193735 0.189684 0.188686 0.209141 0.209415 0.187212 0.187889 0.204564 0.205384 0.194643 0.194661 0.209623 0.209655 0.214821 0.232888 0.231550 0.246975 0.214889 0.350888
chargesum: 0.00000
title: Mulliken charges with hydrogens summed into heavy atoms:
elementType: O C C C C C C C C C C C C C C C C C C
charge: -0.086776 0.002155 0.001476 0.000705 0.002359 0.001984 0.018086 0.005623 0.031190 0.021894 -0.162179 0.032628 0.517622 -0.062638 -0.151748 -0.171809 -0.104868 -0.172398 0.276694
polarizability: 2.73496280e+02 -2.15436866e+01 1.58614522e+02 -1.12374807e+01 -8.45861954e+00 1.69877043e+02
1716.lowfreq: -28.7489 -9.4603 -4.5106 -0.0018 -0.0006 0.0010 2.2778 10.2479 16.2365
frequency: -25.8488 9.8044 15.6936 25.0353 41.6578 48.0912 58.8735 81.0947 88.9391 96.5663 117.8318 128.2130 131.4543 145.8159 150.7245 152.7437 206.7757 230.7942 259.9748 294.8469 302.3083 349.4956 353.7004 393.5300 403.1249 410.5005 421.7832 477.8293 481.7583 505.5603 547.5474 636.4196 717.5873 718.1499 719.9912 724.8267 735.1348 753.6315 756.0301 786.7228 806.2304 823.9245 828.8705 838.4380 878.5964 886.8832 928.6658 931.5184 959.8445 979.1099 981.0893 982.4874 1004.0016 1016.3897 1021.1791 1023.6021 1047.9061 1067.6732 1068.0939 1073.4243 1079.6898 1080.6733 1083.9376 1116.8865 1122.1777 1142.2081 1178.7428 1180.5762 1197.8299 1200.3420 1214.0594 1224.6401 1227.9602 1245.0542 1249.1729 1254.2016 1269.0694 1275.6856 1279.2493 1280.1379 1285.3266 1287.5956 1293.1295 1294.4666 1303.8128 1319.5397 1324.7136 1338.9528 1348.4209 1351.1872 1354.3025 1354.5242 1387.6374 1390.3876 1425.1625 1458.1956 1458.3002 1461.5717 1461.7192 1464.5107 1466.3010 1470.4985 1475.3622 1476.4485 1480.2049 1484.4459 1487.8116 1489.2075 1504.6506 1598.2300 1626.7550 2947.4914 2947.6701 2948.9608 2950.1809 2950.5845 2953.7682 2958.3436 2962.8225 2966.8027 2967.3289 2971.1165 2976.5346 2980.4859 2983.1345 2986.8641 2992.4721 3000.2112 3008.8809 3015.8930 3024.2456 3033.2208 3040.6746 3047.3598 3067.8691 3069.6108 3107.1952 3121.5113 3134.2046 3167.3149 3583.1072
redmass: 1.8487 3.4371 4.3232 3.8177 3.4606 2.8732 1.9429 2.5577 3.2093 2.0086 2.0746 2.0031 5.2632 1.9828 2.3367 3.1201 3.9920 1.1009 3.7674 3.4204 3.1305 1.1135 3.6657 4.0431 3.1858 2.9448 3.2272 3.7240 3.0157 3.2635 2.8764 6.7593 3.7029 1.0586 1.0667 1.0792 1.1025 1.2878 2.9420 1.1913 1.4370 2.8422 1.2447 1.9140 1.2500 1.9017 1.3581 1.2583 1.3695 3.0910 2.1634 2.1359 2.8450 4.0719 2.4584 1.2730 3.2708 2.5257 1.4025 2.6313 2.1494 2.1970 2.4069 1.2789 2.8510 1.3718 1.1100 1.9040 1.3320 1.5218 2.1229 1.4349 1.3454 2.8440 1.3468 1.3346 1.2543 1.0250 1.2959 1.0888 1.1455 1.0841 1.1085 1.1227 1.3537 1.2698 1.3852 1.4526 1.5437 1.7230 1.6341 1.6517 1.2169 6.1322 2.7967 1.0736 1.0737 1.0675 1.0743 1.0682 1.0818 1.0881 1.0882 1.0428 1.0894 1.0924 1.0898 1.1007 2.7622 6.4472 6.4633 1.0584 1.0585 1.0587 1.0590 1.0591 1.0594 1.0592 1.0587 1.0587 1.0589 1.0364 1.0594 1.0959 1.0967 1.0981 1.1000 1.1018 1.1025 1.1034 1.1048 1.1050 1.1047 1.1046 1.1006 1.0993 1.0873 1.0897 1.0960 1.0951 1.0659
irintensity: 0.0437 0.4796 0.1557 0.2186 0.0595 0.0226 0.0233 0.0711 0.1004 0.0443 0.0086 0.0144 0.1340 0.0044 0.0392 0.0778 0.1741 0.0006 0.0793 0.8982 2.4586 139.4902 5.7338 0.0585 10.9413 1.9106 0.2149 2.4380 3.8598 10.0870 25.5450 0.7757 1.9642 18.5685 0.4260 6.2184 0.0236 4.4444 14.2189 0.4617 29.3203 11.5998 0.7539 35.1539 0.3608 4.9079 0.0890 0.2496 0.1157 0.0564 0.1288 0.2955 3.1829 0.5834 3.0291 0.1558 0.2467 1.9348 9.4209 0.5731 0.1367 0.0219 0.4402 49.1097 18.4025 206.3756 6.0588 0.3389 19.1283 6.0781 3.4777 0.4241 1.0790 27.3144 0.3568 0.6486 0.1710 0.1574 0.2409 0.2855 0.1172 0.2816 0.2198 0.0142 0.8365 11.8821 2.4145 0.1897 0.7181 0.3351 0.1681 0.0231 11.2656 13.6879 13.4442 0.0311 0.0032 0.0063 0.0499 0.0208 0.2837 0.4213 0.5979 12.2904 1.1126 0.5507 9.6076 38.1662 106.5606 9.1630 23.7899 0.0333 0.3266 1.2775 0.5351 1.5212 3.4836 0.1920 89.3455 109.8824 92.2095 38.6505 116.5518 0.2097 0.2267 0.3500 0.4447 0.5714 0.3362 0.8719 2.7090 2.3544 144.8268 208.2320 96.4592 56.9070 20.9655 20.7284 16.9136 7.1623 36.0954
temp: 298.150 k
press: 1.00000 atm
elementType: 8 6 6 6 6 6 6 6 6 6 6 6 6 6 6 6 6 6 6 1 1 1 1 1 1 1 1 1 1 1 1 1 1 1 1 1 1 1 1 1 1 1 1 1 1 1 1 1 1
symmnumber: 1
zpe: 1144347.8 jmol-1
zpe.correction: 0.435859 hartree
zpe.thermalcorrener: 0.457802 hartree
zpe.thermalcorrenthalpy: 0.458746 hartree
zpe.thermalcorrgfe: 0.380104 hartree
zpe.sumelectzpe: -777.631893 hartree
zpe.sumelectthermal: -777.609950 hartree
zpe.sumelectthermalent: -777.609006 hartree
zpe.sumelectthermalfe: -777.687648 hartree
dipole: -0.5721 0.8257 -1.3931
dipole: 1.7175
quadrupole: -124.4768 -123.3561 -112.2350
quadrupole: 3.2967 -15.3826 -1.4834
quadrupole: -4.4541 -3.3335 7.7876 3.2967 -15.3826 -1.4834
hfenergy: -778.0677519 hartree
pointgroup: C01 [X(C18H30O1)]
dipole: -0.2283363 0.3961024 -0.4975659 debye
polarizability: 273.4768948|-19.5468338|161.0093343|-14.5132446|-9.6196606|167.5016164 unknown
InChI: InChI=1S/C18H30O/c1-2-3-4-5-6-7-8-9-10-11-12-17-13-15-18(19)16-14-17/h13-16,19H,2-12H2,1H3
charge 0 multiplicity 1
49 atoms
O  8.388421 -1.446794 -0.508542
C  -2.97776 -0.095121 -0.194294
C  -1.777036 0.773372 0.243951
C  -4.346464 0.510998 0.189477
C  -0.408296 0.140286 -0.094289
C  -5.546417 -0.358671 -0.248684
C  0.793364 1.006492 0.345965
C  -6.913998 0.227047 0.169585
C  2.158875 0.349698 0.045673
C  -8.114028 -0.642976 -0.267676
C  3.363446 1.221793 0.497713
C  -9.480518 -0.066332 0.168036
C  4.706435 0.559163 0.228357
C  -10.673655 -0.942419 -0.271517
C  5.241286 -0.398345 1.131905
C  5.443265 0.839664 -0.948962
C  6.46087 -1.056229 0.876784
C  6.668266 0.19093 -1.224355
C  7.174239 -0.760039 -0.307099
H  -2.93849 -0.248277 -1.293191
H  -2.884773 -1.103046 0.262292
H  -1.835564 0.951756 1.33833
H  -1.850279 1.771312 -0.237134
H  -4.441364 1.521125 -0.261644
H  -4.384368 0.65817 1.289403
H  -0.347684 -0.043306 -1.187392
H  -0.337735 -0.855613 0.391275
H  -5.437245 -1.375695 0.183515
H  -5.523616 -0.48681 -1.351282
H  0.717666 1.21095 1.434947
H  0.740061 1.994033 -0.158912
H  -7.024301 1.245295 -0.259392
H  -6.935595 0.35173 1.272751
H  2.216525 -0.635559 0.551408
H  2.247035 0.145765 -1.040754
H  -7.998749 -1.664579 0.151976
H  -8.101719 -0.758664 -1.371899
H  3.25441 1.433657 1.58039
H  3.309736 2.198027 -0.023491
H  -9.491174 0.048809 1.271333
H  -9.595497 0.954349 -0.25121
H  -10.703037 -1.047744 -1.372635
H  -10.598652 -1.958823 0.159475
H  -11.637737 -0.508405 0.052168
H  4.695178 -0.628954 2.055159
H  5.057927 1.578204 -1.662614
H  6.874685 -1.789832 1.575185
H  7.223736 0.427399 -2.141941
H  8.808425 -1.169091 -1.360041
