program: Orca
programVersion: 4.2.1
elementType: O O O N N N N C C C C C C C C C C C C C C H H H H H H H H H H H H H H H H H H
charge: 0
multiplicity: 1
keywords: wb97x-d3
keywords: def2-TZVPP
keywords: def2/J RIJCOSX GRIDX6 NOFINALGRIDX
keywords: grid4 nofinalgrid
keywords: scfconv7
keywords: smallprint printgap noloewdin
keywords: NOSOSCF
formula: C14H18N4O3
InChI: InChI=1/C14H18N4O3/c1-3-4-9-15-13(19)18-11-8-6-5-7-10(11)16-12(18)17-14(20)21-2/h5-8,15-16H,3-4,9H2,1-2H3
39 atoms
O  -0.660037 -2.787038 0.088649
O  2.591027 2.41466 0.482106
O  0.598865 3.34783 0.065809
N  -0.869384 -0.524588 0.190487
N  1.144393 -1.569895 0.724425
N  -1.442266 1.574535 -0.074091
N  0.862983 1.065312 0.360682
C  2.717895 -2.909937 -0.655314
C  2.089945 -2.668757 0.711813
C  -2.253698 -0.501772 -0.043886
C  3.375078 -1.680265 -1.276197
C  -2.599154 0.837119 -0.206706
C  -0.394047 0.773809 0.168882
C  -0.111678 -1.724276 0.319329
C  -3.226556 -1.487912 -0.103137
C  -3.896235 1.249052 -0.442918
C  4.417254 -1.011871 -0.390207
C  -4.534432 -1.080197 -0.339456
C  -4.867757 0.260943 -0.509815
C  1.276362 2.354746 0.283116
C  3.197585 3.701795 0.431961
H  1.957651 -3.296913 -1.338932
H  3.460298 -3.704656 -0.538066
H  2.858058 -2.433095 1.447797
H  1.598096 -3.573762 1.065065
H  3.84303 -1.983027 -2.215742
H  2.609328 -0.949823 -1.55107
H  1.500194 -0.614574 0.742669
H  -2.99905 -2.532181 0.027243
H  -4.13864 2.295506 -0.566593
H  5.170285 -1.725895 -0.050341
H  4.936732 -0.219125 -0.929479
H  3.977399 -0.55127 0.49644
H  -5.310639 -1.831372 -0.391494
H  -5.896629 0.538282 -0.693721
H  4.256399 3.539065 0.614217
H  3.074981 4.169928 -0.54495
H  2.804216 4.365967 1.201852
H  -1.352025 2.578468 -0.141753
elementType: O N C H
totalener: -989.19649791 hartree
nucrepener: 1722.70583678 hartree
electener: -2711.90233469 hartree
oneelecener: -4768.26516119 hartree
twoeener: 2056.36282650 hartree
cpcmener: -0.02976917 hartree
kineticenergy: 985.03132987 hartree
xcener: -94.235888626962 hartree
chargesum: -0.0000000
charge: -0.534869 -0.303925 -0.551159 -0.034001 -0.233415 -0.137507 -0.470678 -0.115798 -0.076388 0.107359 -0.120892 0.060328 0.380321 0.418821 -0.200646 -0.171394 -0.269676 -0.162447 -0.146150 0.522511 -0.126270 0.078471 0.080650 0.117954 0.102792 0.075849 0.058426 0.200064 0.161020 0.158334 0.091945 0.094223 0.063585 0.161203 0.163682 0.124153 0.114003 0.114490 0.205030
qa: -0.5349 -0.3039 -0.5512 -0.0340 -0.2334 -0.1375 -0.4707 -0.1158 -0.0764 0.1074 -0.1209 0.0603 0.3803 0.4188 -0.2006 -0.1714 -0.2697 -0.1624 -0.1461 0.5225 -0.1263 0.0785 0.0806 0.1180 0.1028 0.0758 0.0584 0.2001 0.1610 0.1583 0.0919 0.0942 0.0636 0.1612 0.1637 0.1242 0.1140 0.1145 0.2050
va: 1.9721 2.0890 1.9341 3.2906 3.2009 3.4339 2.8740 3.8306 3.8791 3.7794 3.8721 3.8670 4.1115 4.2614 3.9894 3.9434 3.9337 3.9109 3.8877 4.2612 3.8755 1.0184 1.0141 0.9916 1.0203 1.0115 1.0198 1.0556 1.0254 0.9987 1.0021 1.0053 1.0069 0.9914 0.9880 0.9959 0.9931 0.9935 1.0245
dispcorr: -0.017645250 hartree
energy: -989.214143156038
dipole: 20.94672 -20.80347 0.14325 -5.66527 6.76225 1.09697 -3.08236 3.07627 -0.00608
magnitude: 1.10630 au
magnitude: 2.81200 debye
