program: Orca
programVersion: 4.2.1
elementType: O O O N N N N C C C C C C C C C C C C C C H H H H H H H H H H H H H H H H H H
charge: 0
multiplicity: 1
keywords: wb97x-d3
keywords: def2-TZVPP
keywords: def2/J RIJCOSX GRIDX6 NOFINALGRIDX
keywords: grid4 nofinalgrid
keywords: scfconv7
keywords: smallprint printgap noloewdin
keywords: NOSOSCF
formula: C14H18N4O3
InChI: InChI=1/C14H18N4O3/c1-3-4-9-15-13(19)18-11-8-6-5-7-10(11)16-12(18)17-14(20)21-2/h5-8,15-16H,3-4,9H2,1-2H3
39 atoms
O  -0.470219 -2.57568 0.785407
O  2.500952 2.813648 0.176946
O  0.453682 3.52064 -0.38647
N  -0.761879 -0.362087 0.368017
N  1.300628 -1.187366 1.077091
N  -1.446773 1.623902 -0.258947
N  0.877526 1.33396 0.255203
C  3.27731 -2.384056 0.196173
C  2.295962 -2.206336 1.346521
C  -2.14393 -0.457064 0.132298
C  2.648096 -2.892335 -1.093746
C  -2.559401 0.811877 -0.263119
C  -0.358914 0.937311 0.119333
C  0.044618 -1.472829 0.752658
C  -3.064545 -1.48957 0.233408
C  -3.871595 1.10708 -0.576494
C  3.676235 -3.072001 -2.201027
C  -4.387777 -1.199459 -0.079235
C  -4.789546 0.07204 -0.479301
C  1.196789 2.624456 -0.017029
C  3.008616 4.122419 -0.062421
H  4.048706 -3.08476 0.528096
H  3.788766 -1.434387 0.00872
H  2.838143 -1.916531 2.247145
H  1.793146 -3.145543 1.569743
H  2.143121 -3.843274 -0.901852
H  1.875383 -2.196839 -1.432977
H  1.615119 -0.230941 0.925561
H  -2.788845 -2.483626 0.540424
H  -4.162744 2.102447 -0.882245
H  4.447062 -3.789578 -1.914335
H  3.215087 -3.434217 -3.120371
H  4.175351 -2.129339 -2.433036
H  -5.12162 -1.990431 -0.00764
H  -5.828196 0.25699 -0.716177
H  4.074052 4.070547 0.143006
H  2.861387 4.430384 -1.097792
H  2.554917 4.859431 0.60055
H  -1.41079 2.604214 -0.499901
elementType: O N C H
totalener: -989.19846578 hartree
nucrepener: 1700.28716816 hartree
electener: -2689.48563394 hartree
oneelecener: -4723.48780834 hartree
twoeener: 2034.00217440 hartree
cpcmener: -0.03042581 hartree
kineticenergy: 985.03360702 hartree
xcener: -94.235598212143 hartree
chargesum: 0.0000000
charge: -0.530660 -0.320425 -0.548954 -0.032832 -0.227408 -0.138263 -0.482778 -0.108660 -0.040786 0.109619 -0.081551 0.058233 0.387671 0.400848 -0.205223 -0.171414 -0.284928 -0.160900 -0.145833 0.527562 -0.125273 0.071656 0.066103 0.109834 0.096274 0.061065 0.057669 0.199299 0.161753 0.158395 0.081549 0.091850 0.080015 0.161353 0.163351 0.127422 0.114574 0.114737 0.205056
qa: -0.5307 -0.3204 -0.5490 -0.0328 -0.2274 -0.1383 -0.4828 -0.1087 -0.0408 0.1096 -0.0816 0.0582 0.3877 0.4008 -0.2052 -0.1714 -0.2849 -0.1609 -0.1458 0.5276 -0.1253 0.0717 0.0661 0.1098 0.0963 0.0611 0.0577 0.1993 0.1618 0.1584 0.0815 0.0918 0.0800 0.1614 0.1634 0.1274 0.1146 0.1147 0.2051
va: 1.9739 2.0734 1.9347 3.2896 3.2113 3.4309 2.8601 3.8548 3.8603 3.7797 3.8515 3.8681 4.1069 4.2639 3.9899 3.9416 3.9472 3.9073 3.8900 4.2630 3.8725 1.0150 1.0142 1.0019 1.0243 1.0096 1.0142 1.0551 1.0263 0.9987 1.0002 1.0030 1.0004 0.9911 0.9882 0.9958 0.9935 0.9934 1.0255
dispcorr: -0.016228332 hartree
energy: -989.214694110388
dipole: 18.95712 -18.85929 0.09783 -10.72866 11.77905 1.05039 -5.96887 5.79395 -0.17492
magnitude: 1.06934 au
magnitude: 2.71805 debye
