program: Gaussian 09
title: 000066028
version: EM64L-G09RevD.01
frameworkgroup: C1[X(C13H13N)]
method: RPBEPBE
basis: SDD
operation: Freq
keyword: #pfreq=noraman
keyword: PBEPBE/SDD
title: #p freq=noraman PBEPBE/SDD
converged: YES YES NO NO
title: Mulliken charges:
elementType: N C C C C C C C C C C C C C H H H H H H H H H H H H H
charge: -0.437597 -0.481631 0.417618 0.466968 -0.439263 -0.384659 -0.365703 -0.423597 -0.220875 -0.222623 -0.238601 -0.225724 -0.196998 -0.275216 0.219653 0.222339 0.297317 0.236059 0.258630 0.233540 0.214498 0.228050 0.228174 0.230540 0.216993 0.218420 0.223688
chargesum: 0.00000
title: Mulliken charges with hydrogens summed into heavy atoms:
elementType: N C C C C C C C C C C C C C
charge: -0.140280 -0.039639 0.417618 0.466968 -0.203204 -0.126029 -0.132163 -0.209100 0.007175 0.005551 -0.008061 -0.008732 0.021423 -0.051528
polarizability: 2.23067335e+02 2.33811556e+00 1.27326183e+02 -1.05081963e+01 5.66445006e-01 8.51409925e+01
1716.lowfreq: -0.0006 0.0003 0.0005 3.7387 5.4701 13.7213 28.1153 35.3464 64.3258
frequency: 28.0777 35.1077 64.3170 108.0145 169.9707 222.3419 242.5323 310.0810 395.0464 409.1913 410.5813 428.5473 506.2530 513.1513 527.9453 612.9554 616.8559 623.2801 690.8823 705.7653 750.8925 754.5534 798.4336 813.9163 849.5753 857.7134 868.2993 919.2757 953.8251 972.6537 976.6414 980.0753 987.7139 992.2582 999.1483 1022.8334 1026.3057 1073.3950 1085.5050 1114.2637 1168.8130 1172.6108 1186.0306 1187.5206 1205.6728 1222.2010 1275.7137 1319.1262 1328.6768 1349.0062 1383.6920 1387.7823 1430.6401 1440.1117 1479.7551 1482.4547 1493.7970 1507.3565 1588.1584 1594.4028 1615.5078 1625.0616 2917.3999 2968.4503 3109.2612 3119.7440 3123.0575 3125.1255 3135.7335 3137.3412 3148.0707 3150.6347 3164.5148 3165.6816 3560.9324
redmass: 3.9258 4.1604 4.2939 3.6466 5.1144 3.5171 4.5158 3.0232 1.6345 2.7842 2.1081 2.3776 2.7284 3.1420 5.8774 6.3196 6.3430 5.4170 1.8411 1.9788 1.6930 1.7233 4.7802 1.2680 3.5283 1.2513 1.5277 1.3637 1.3644 1.2985 5.6979 1.3879 2.6729 2.4487 1.4104 2.2323 2.1865 2.0589 1.5392 2.6952 1.0481 1.0542 1.1110 1.1086 1.2846 1.9258 1.6113 1.3466 1.5306 1.6094 6.0614 3.8064 2.3155 2.1602 1.7867 2.1041 1.2809 2.2255 5.2256 6.1176 6.1216 6.2536 1.0640 1.0955 1.0867 1.0865 1.0858 1.0868 1.0930 1.0916 1.0963 1.0936 1.1016 1.1008 1.0769
irintensity: 0.1526 0.0002 0.6287 3.4355 1.4536 0.3454 1.0757 2.2063 76.5811 5.7949 33.4063 32.0294 14.0747 13.0042 2.7170 0.1386 0.6332 1.5962 40.7447 40.0394 35.7256 111.8041 3.9629 0.4515 5.2787 0.1435 8.5257 4.1880 0.0847 0.5554 5.1100 0.1383 1.9825 2.9415 1.2676 3.4058 14.6580 10.9844 11.8274 13.2718 1.1662 0.0617 1.7161 9.0827 11.0513 6.8052 32.8646 1.5938 43.6337 5.9764 17.7158 39.5476 28.6483 13.6075 5.7400 43.5341 74.9087 167.9037 9.7847 0.7742 10.8204 227.7111 63.3593 26.0394 14.9381 6.9374 4.6340 0.4537 30.9301 15.4801 38.1066 46.8956 24.0214 13.2116 33.6681
temp: 298.150 k
press: 1.00000 atm
elementType: 7 6 6 6 6 6 6 6 6 6 6 6 6 6 1 1 1 1 1 1 1 1 1 1 1 1 1
symmnumber: 1
zpe: 584305.3 jmol-1
zpe.correction: 0.222550 hartree
zpe.thermalcorrener: 0.234420 hartree
zpe.thermalcorrenthalpy: 0.235364 hartree
zpe.thermalcorrgfe: 0.182798 hartree
zpe.sumelectzpe: -556.945564 hartree
zpe.sumelectthermal: -556.933695 hartree
zpe.sumelectthermalent: -556.932750 hartree
zpe.sumelectthermalfe: -556.985316 hartree
dipole: 2.1612 0.0520 -0.4201
dipole: 2.2022
quadrupole: -78.2930 -76.4446 -85.2700
quadrupole: 0.5824 -1.7986 -0.7553
quadrupole: 1.7095 3.5580 -5.2675 0.5824 -1.7986 -0.7553
hfenergy: -557.1681145 hartree
pointgroup: C01 [X(C13H13N1)]
dipole: -0.8452233 -0.1285252 -0.1406289 debye
polarizability: 222.3748854|10.0958442|109.529201|10.5263517|-20.4992743|103.6304245 unknown
InChI: InChI=1S/C13H13N/c1-3-7-12(8-4-1)11-14-13-9-5-2-6-10-13/h1-10,14H,11H2
charge 0 multiplicity 1
27 atoms
N  0.46262 -0.330392 -0.080848
C  -0.460689 0.737048 -0.482567
C  -1.910025 0.330766 -0.24457
C  1.84876 -0.167309 0.014408
C  -2.868751 0.429557 -1.281862
C  -2.324717 -0.134351 1.031494
C  2.479871 1.094095 -0.201764
C  2.66821 -1.288625 0.350089
C  -4.219411 0.07747 -1.051845
C  -3.671286 -0.49155 1.262174
C  -4.62406 -0.38559 0.220633
C  3.88002 1.220327 -0.068461
C  4.062865 -1.147278 0.472053
C  4.685688 0.109387 0.268135
H  -0.322439 1.019519 -1.550552
H  -0.230292 1.644255 0.114846
H  0.092161 -1.280886 -0.08442
H  -2.557858 0.780679 -2.273532
H  -1.587248 -0.208884 1.839361
H  1.886691 1.970078 -0.482657
H  2.199025 -2.266752 0.518662
H  -4.950303 0.159612 -1.864113
H  -3.979978 -0.846702 2.251922
H  -5.669189 -0.66154 0.400031
H  4.343805 2.19951 -0.237411
H  4.66949 -2.023295 0.730431
H  5.771042 0.215551 0.365263
