program: Orca
programVersion: 4.2.1
elementType: O O O N N N N C C C C C C C C C C C C C C H H H H H H H H H H H H H H H H H H
charge: 0
multiplicity: 1
keywords: wb97x-d3
keywords: def2-TZVPP
keywords: def2/J RIJCOSX GRIDX6 NOFINALGRIDX
keywords: grid4 nofinalgrid
keywords: scfconv7
keywords: smallprint printgap noloewdin
keywords: NOSOSCF
formula: C14H18N4O3
InChI: InChI=1/C14H18N4O3/c1-3-4-9-15-13(19)18-11-8-6-5-7-10(11)16-12(18)17-14(20)21-2/h5-8,15-16H,3-4,9H2,1-2H3
39 atoms
O  -0.759088 -2.783673 -0.378934
O  2.62441 2.298627 0.149658
O  0.626423 3.26775 0.439092
N  -0.913784 -0.516557 -0.276968
N  1.130474 -1.558202 -0.666525
N  -1.473278 1.56057 0.142775
N  0.855592 1.024275 -0.081791
C  2.843736 -2.824154 0.590436
C  2.07157 -2.657084 -0.713956
C  -2.313835 -0.474804 -0.201943
C  3.581176 -1.571526 1.060474
C  -2.652075 0.850925 0.062551
C  -0.418943 0.75602 -0.064773
C  -0.167724 -1.723264 -0.4379
C  -3.303849 -1.432421 -0.360139
C  -3.96143 1.272806 0.191316
C  4.57005 -1.008202 0.048975
C  -4.623073 -1.013245 -0.23331
C  -4.95074 0.311788 0.040307
C  1.295138 2.278997 0.189119
C  3.261696 3.541024 0.418772
H  3.559297 -3.639653 0.44791
H  2.154179 -3.152126 1.373385
H  1.540092 -3.575683 -0.955585
H  2.756549 -2.470491 -1.542797
H  2.861143 -0.794331 1.333087
H  4.112808 -1.816346 1.983425
H  1.488816 -0.605629 -0.599424
H  -3.077819 -2.463608 -0.573563
H  -4.200947 2.307145 0.397887
H  5.123593 -0.168832 0.471681
H  5.2991 -1.761022 -0.259413
H  4.079567 -0.638962 -0.853561
H  -5.413184 -1.74252 -0.352154
H  -5.989547 0.598429 0.133983
H  4.329554 3.35146 0.342307
H  2.986229 4.306837 -0.307587
H  3.038689 3.903938 1.423057
H  -1.373014 2.549567 0.324176
elementType: O N C H
totalener: -989.20565318 hartree
nucrepener: 1721.15607855 hartree
electener: -2710.36173172 hartree
oneelecener: -4765.08358381 hartree
twoeener: 2054.72185209 hartree
cpcmener: -0.02421042 hartree
kineticenergy: 985.03410391 hartree
xcener: -94.235026744792 hartree
chargesum: 0.0000000
charge: -0.510474 -0.292345 -0.530760 -0.041845 -0.223943 -0.141415 -0.470673 -0.108807 -0.083875 0.109375 -0.117456 0.056143 0.377938 0.408184 -0.198148 -0.168672 -0.272104 -0.155783 -0.145522 0.508409 -0.123867 0.073911 0.076342 0.100354 0.119307 0.054465 0.074955 0.196983 0.159026 0.153897 0.091745 0.093403 0.069343 0.157591 0.158966 0.118922 0.112363 0.112548 0.201521
qa: -0.5105 -0.2923 -0.5308 -0.0418 -0.2239 -0.1414 -0.4707 -0.1088 -0.0839 0.1094 -0.1175 0.0561 0.3779 0.4082 -0.1981 -0.1687 -0.2721 -0.1558 -0.1455 0.5084 -0.1239 0.0739 0.0763 0.1004 0.1193 0.0545 0.0750 0.1970 0.1590 0.1539 0.0917 0.0934 0.0693 0.1576 0.1590 0.1189 0.1124 0.1125 0.2015
va: 2.0035 2.0964 1.9604 3.2887 3.2023 3.4299 2.8772 3.8691 3.8716 3.7837 3.8600 3.8737 4.1162 4.2760 3.9942 3.9496 3.9310 3.9119 3.8971 4.2784 3.8836 1.0143 1.0137 1.0267 0.9897 1.0273 1.0123 1.0540 1.0269 1.0000 1.0067 1.0021 1.0045 0.9925 0.9898 0.9957 0.9938 0.9930 1.0270
dispcorr: -0.017664532 hartree
energy: -989.223317709673
dipole: 21.84522 -21.64772 0.19751 -5.49315 6.54441 1.05126 2.56078 -2.49668 0.06409
magnitude: 1.07157 au
magnitude: 2.72370 debye
