program: Orca
programVersion: 4.2.1
elementType: O O O N N N N C C C C C C C C C C C C C C H H H H H H H H H H H H H H H H H H
charge: 0
multiplicity: 1
keywords: wb97x-d3
keywords: def2-TZVPP
keywords: def2/J RIJCOSX GRIDX6 NOFINALGRIDX
keywords: grid4 nofinalgrid
keywords: scfconv7
keywords: smallprint printgap noloewdin
keywords: NOSOSCF
formula: C14H18N4O3
InChI: InChI=1/C14H18N4O3/c1-3-4-9-15-13(19)18-11-8-6-5-7-10(11)16-12(18)17-14(20)21-2/h5-8,15-16H,3-4,9H2,1-2H3
39 atoms
O  -0.727703 -2.593585 0.050923
O  2.417536 2.748342 0.100046
O  0.348433 3.583745 -0.039237
N  -0.947649 -0.326217 -0.018312
N  1.151084 -1.338181 0.151375
N  -1.586135 1.770371 -0.106149
N  0.75854 1.30505 0.039313
C  3.48418 -1.962655 0.388167
C  2.054745 -2.463574 0.24813
C  -2.348342 -0.323134 -0.097928
C  4.500585 -3.082698 0.583703
C  -2.737599 1.014458 -0.151976
C  -0.500229 0.978638 -0.024757
C  -0.165183 -1.52377 0.063357
C  -3.298834 -1.331118 -0.125874
C  -4.06161 1.39882 -0.233243
C  4.620363 -4.031193 -0.602123
C  -4.631778 -0.947831 -0.2077
C  -5.011741 0.389064 -0.260279
C  1.095534 2.623214 0.027064
C  2.933384 4.067451 0.099559
H  3.537444 -1.279376 1.240862
H  3.753266 -1.374762 -0.49557
H  1.79113 -3.08264 1.11075
H  1.951341 -3.099228 -0.634894
H  5.475771 -2.631058 0.779732
H  4.247857 -3.650231 1.484288
H  1.504839 -0.382391 0.145626
H  -3.021265 -2.370478 -0.085902
H  -4.344062 2.442058 -0.273378
H  3.703149 -4.59492 -0.773819
H  4.849388 -3.487469 -1.520347
H  5.417809 -4.75708 -0.443429
H  -5.391996 -1.716505 -0.230645
H  -6.059998 0.646977 -0.322985
H  2.575502 4.645818 0.952343
H  4.013555 3.964139 0.164749
H  2.678429 4.605401 -0.814493
H  -1.476945 2.775632 -0.12424
totalener: -989.18511315 hartree
nucrepener: 1674.20933426 hartree
electener: -2663.39444741 hartree
oneelecener: -4670.78763291 hartree
twoeener: 2007.39318549 hartree
kineticenergy: 985.06717161 hartree
xcener: -94.235570198914 hartree
chargesum: 0.0000000
charge: -0.428269 -0.279918 -0.473033 -0.050138 -0.243171 -0.165961 -0.453112 -0.124736 -0.028489 0.080990 -0.113244 0.039579 0.361301 0.387378 -0.157047 -0.130852 -0.258615 -0.114853 -0.116881 0.468829 -0.129044 0.079989 0.072662 0.085277 0.089011 0.070780 0.055287 0.190801 0.157248 0.121759 0.078742 0.076809 0.087704 0.125029 0.125607 0.107141 0.115497 0.106839 0.183105
qa: -0.4283 -0.2799 -0.4730 -0.0501 -0.2432 -0.1660 -0.4531 -0.1247 -0.0285 0.0810 -0.1132 0.0396 0.3613 0.3874 -0.1570 -0.1309 -0.2586 -0.1149 -0.1169 0.4688 -0.1290 0.0800 0.0727 0.0853 0.0890 0.0708 0.0553 0.1908 0.1572 0.1218 0.0787 0.0768 0.0877 0.1250 0.1256 0.1071 0.1155 0.1068 0.1831
va: 2.0879 2.1079 2.0154 3.3006 3.2145 3.4072 2.8918 3.8853 3.8820 3.8807 3.9190 3.9229 4.1157 4.2685 4.0327 4.0035 3.9322 3.9391 3.9706 4.3104 3.9079 1.0111 1.0086 1.0032 1.0049 1.0071 1.0095 1.0584 1.0289 1.0085 1.0019 1.0025 1.0061 1.0029 1.0006 0.9955 0.9944 0.9956 1.0540
dispcorr: -0.015420289 hartree
energy: -989.200533443355
dipole: 23.64845 -23.37428 0.27417 -12.67603 13.31706 0.64104 0.18910 -0.15892 0.03018
magnitude: 0.69786 au
magnitude: 1.77382 debye
