program: Gaussian 09
title: 000066033
version: EM64L-G09RevD.01
frameworkgroup: C1[X(C16H16N2)]
method: RPBEPBE
basis: SDD
operation: Freq
keyword: #pfreq=noraman
keyword: PBEPBE/SDD
title: #p freq=noraman PBEPBE/SDD
converged: YES YES NO NO
title: Mulliken charges:
elementType: N N C C C C C C C C C C C C C C C C H H H H H H H H H H H H H H H H
charge: -0.054062 -0.053826 -0.430459 -0.430726 0.428175 0.428138 -0.316312 -0.316442 -0.376616 -0.376666 -0.376782 -0.376766 -0.227106 -0.227090 -0.221481 -0.221480 -0.232365 -0.232397 0.192513 0.222548 0.192548 0.222502 0.206347 0.206374 0.228565 0.228572 0.273471 0.273489 0.227789 0.227767 0.226962 0.226950 0.228941 0.228926
chargesum: 0.00000
title: Mulliken charges with hydrogens summed into heavy atoms:
elementType: N N C C C C C C C C C C C C C C C C
charge: -0.054062 -0.053826 -0.015399 -0.015676 0.428175 0.428138 -0.109965 -0.110068 -0.148051 -0.148094 -0.103312 -0.103277 0.000683 0.000678 0.005480 0.005470 -0.003425 -0.003471
polarizability: 1.76753771e+02 1.66668711e-01 2.32514666e+02 2.62903670e+01 4.73953323e-02 1.59899892e+02
1716.lowfreq: -0.0006 -0.0004 -0.0001 5.3774 5.6647 13.7692 15.6899 26.8160 27.5434
frequency: 15.6255 26.7516 27.4874 67.1261 78.6600 97.7676 125.5299 147.0969 180.5330 269.3053 280.0639 319.3669 335.8599 353.7928 394.1546 406.6608 406.7204 444.4537 476.9155 508.2142 556.3047 614.8465 615.0829 627.4881 628.7377 700.3941 700.9065 769.7989 770.6165 837.2824 841.0200 857.3557 858.1297 860.1288 911.6699 927.8199 934.1781 975.6175 977.9559 986.7820 986.8988 988.7430 988.9439 1005.6731 1005.8961 1021.4612 1021.8511 1030.4117 1038.0196 1079.2658 1081.5403 1093.4326 1170.6812 1170.9805 1178.6932 1179.7472 1204.8699 1225.2846 1233.8133 1241.1411 1306.7262 1311.9187 1322.3544 1335.0330 1367.4503 1368.8306 1395.8305 1396.0352 1439.9404 1440.1109 1453.8595 1466.3746 1482.1875 1482.2408 1584.7301 1584.8888 1611.1905 1611.3243 1627.5429 1629.0206 2921.6967 2925.6204 2926.2447 2930.8233 3030.1647 3035.9815 3117.2093 3117.2473 3127.4823 3127.4886 3141.2136 3141.2420 3155.5491 3155.5850 3166.1026 3166.2166
redmass: 5.7991 3.7186 3.7756 5.6392 4.5638 4.4022 4.8604 3.5758 3.1030 2.8277 3.0610 4.6564 3.7977 4.6267 3.2561 2.8231 2.8239 3.1977 3.0800 3.0191 3.0841 6.4566 6.4522 4.6600 5.8027 1.7634 1.7980 1.6939 1.7011 3.7709 4.3319 1.3433 1.2504 2.3080 1.8780 1.3786 1.6307 1.7742 1.8498 1.3944 1.4739 6.0245 4.9671 1.3527 1.3648 2.2865 2.1561 2.8132 2.2221 1.5989 1.5713 2.1921 1.0732 1.0689 1.1041 1.1065 1.1753 1.6465 2.1209 1.3762 1.3729 1.4046 1.2529 1.2507 1.9202 1.8596 3.4694 3.6650 2.1828 2.2135 1.1019 1.1284 2.4137 2.4091 6.3807 6.3498 6.0441 6.0405 7.0095 6.9428 1.0722 1.0807 1.0844 1.0642 1.0970 1.0933 1.0871 1.0871 1.0869 1.0869 1.0920 1.0920 1.0957 1.0957 1.1008 1.1008
irintensity: 0.0965 1.6070 0.4152 2.8950 0.0686 0.1283 15.3740 1.1183 12.7200 22.0106 2.9428 0.7665 9.1201 5.3914 4.1775 0.1374 0.2043 0.1830 34.0817 4.4291 0.1469 0.0277 0.0242 7.3421 5.0071 81.7159 19.3274 17.6947 83.6056 1.9564 0.7373 0.7603 0.4376 1.7577 8.7425 0.0479 9.0378 4.8642 22.2210 0.0352 0.6333 0.1151 0.6543 3.0827 0.5629 3.2271 2.4735 6.2115 20.1611 0.8006 11.5310 8.9816 1.9753 1.8876 4.4670 3.4664 1.3787 15.3456 9.1058 3.5952 18.5210 17.0770 2.7462 3.5785 3.0102 0.0328 1.6678 3.5673 0.2424 23.8863 49.8292 7.2451 10.3951 3.6756 20.0214 7.6681 11.1563 3.9743 80.2876 40.7352 61.2187 22.1876 37.3754 167.6677 25.6204 62.5131 2.3917 11.7347 0.3690 1.3937 10.0633 37.1521 21.6150 21.5962 25.8719 21.9908
temp: 298.150 k
press: 1.00000 atm
elementType: 7 7 6 6 6 6 6 6 6 6 6 6 6 6 6 6 6 6 1 1 1 1 1 1 1 1 1 1 1 1 1 1 1 1
symmnumber: 1
zpe: 725325.8 jmol-1
zpe.correction: 0.276262 hartree
zpe.thermalcorrener: 0.292131 hartree
zpe.thermalcorrenthalpy: 0.293076 hartree
zpe.thermalcorrgfe: 0.229661 hartree
zpe.sumelectzpe: -727.499430 hartree
zpe.sumelectthermal: -727.483561 hartree
zpe.sumelectthermalent: -727.482617 hartree
zpe.sumelectthermalfe: -727.546031 hartree
dipole: -0.0122 -1.2267 0.0038
dipole: 1.2268
quadrupole: -106.4506 -95.3860 -96.7714
quadrupole: 0.0062 2.0726 0.0201
quadrupole: -6.9146 4.1500 2.7646 0.0062 2.0726 0.0201
hfenergy: -727.7756923 hartree
pointgroup: C01 [X(C16H16N2)]
dipole: -0.0050432 -0.4826239 -0.0002529 debye
polarizability: 168.9286779|0.1097079|232.5140122|27.6016675|0.2068481|167.725639 unknown
InChI: InChI=1S/C16H16N2/c1-3-7-15(8-4-1)13-17-11-12-18-14-16-9-5-2-6-10-16/h1-10,13-14H,11-12H2
charge 0 multiplicity 1
34 atoms
N  -1.506582 2.229315 -0.257706
N  1.513075 2.228522 0.265116
C  -0.707728 3.323742 0.320171
C  0.71391 3.325398 -0.307856
C  -2.605936 0.063385 0.008518
C  2.604959 0.059816 -0.008804
C  -1.823991 1.216875 0.503965
C  1.823587 1.215846 -0.499156
C  -2.891517 -1.014614 0.888297
C  2.882485 -1.018479 -0.89081
C  -3.081886 0.010785 -1.331117
C  3.08823 0.00496 1.328129
C  -3.637432 -2.127105 0.441209
C  3.627516 -2.133481 -0.448529
C  -3.826751 -1.09883 -1.775453
C  3.832289 -1.10712 1.767635
C  -4.107188 -2.171865 -0.891711
C  4.10459 -2.180454 0.881717
H  -0.599299 3.264266 1.427401
H  -1.197515 4.281374 0.060287
H  0.605077 3.270545 -1.415264
H  1.203428 4.2820 -0.043936
H  -1.521461 1.169216 1.574749
H  1.516076 1.17049 -1.568595
H  -2.524418 -0.979034 1.921962
H  2.509789 -0.981147 -1.922404
H  -2.854123 0.852349 -1.993545
H  2.866574 0.846743 1.992349
H  -3.851496 -2.954595 1.12663
H  3.83528 -2.961206 -1.135608
H  -4.192655 -1.134066 -2.807914
H  4.203846 -1.144042 2.798016
H  -4.687368 -3.03358 -1.24084
H  4.684135 -3.044107 1.227097
