program: Orca
programVersion: 4.2.1
elementType: O O O N N N N C C C C C C C C C C C C C C H H H H H H H H H H H H H H H H H H
charge: 0
multiplicity: 1
keywords: wb97x-d3
keywords: def2-TZVPP
keywords: def2/J RIJCOSX GRIDX6 NOFINALGRIDX
keywords: grid4 nofinalgrid
keywords: scfconv7
keywords: smallprint printgap noloewdin
keywords: NOSOSCF
formula: C14H18N4O3
InChI: InChI=1/C14H18N4O3/c1-3-4-9-15-13(19)18-11-8-6-5-7-10(11)16-12(18)17-14(20)21-2/h5-8,15-16H,3-4,9H2,1-2H3
39 atoms
O  -0.487052 -2.552669 0.820708
O  2.464915 2.869233 0.178159
O  0.398439 3.544055 -0.343108
N  -0.767481 -0.344199 0.357876
N  1.322087 -1.185711 0.968444
N  -1.457562 1.655891 -0.221628
N  0.868643 1.356915 0.259118
C  3.309429 -2.433581 0.187837
C  2.292478 -2.204313 1.300354
C  -2.150083 -0.431842 0.131906
C  2.697766 -2.918136 -1.119654
C  -2.572059 0.845533 -0.233309
C  -0.363584 0.956005 0.13276
C  0.038962 -1.468003 0.734182
C  -3.060979 -1.473221 0.21205
C  -3.889379 1.135937 -0.529557
C  3.749898 -3.205322 -2.181185
C  -4.387241 -1.184524 -0.084564
C  -4.799368 0.092758 -0.449349
C  1.163663 2.660221 0.001201
C  2.935567 4.184648 -0.056516
H  4.038061 -3.1669 0.547945
H  3.873789 -1.511741 0.010951
H  2.809225 -1.903885 2.215294
H  1.761539 -3.128331 1.52408
H  2.102511 -3.816368 -0.932888
H  1.999628 -2.167086 -1.497456
H  1.629076 -0.224574 0.821141
H  -2.759151 -2.468166 0.490579
H  -4.196576 2.133931 -0.81127
H  4.441011 -3.985436 -1.85713
H  3.294195 -3.537775 -3.113882
H  4.341734 -2.315668 -2.403819
H  -5.116126 -1.981405 -0.029061
H  -5.841029 0.277192 -0.673468
H  4.004709 4.156922 0.13788
H  2.765499 4.500812 -1.086568
H  2.467574 4.910539 0.609731
H  -1.378788 2.641223 -0.435307
totalener: -989.18633547 hartree
nucrepener: 1697.62157688 hartree
electener: -2686.80791236 hartree
oneelecener: -4717.67049610 hartree
twoeener: 2030.86258374 hartree
kineticenergy: 985.06969334 hartree
xcener: -94.236195395708 hartree
chargesum: -0.0000000
charge: -0.429184 -0.279597 -0.473106 -0.052843 -0.235694 -0.166041 -0.453746 -0.103633 -0.070423 0.077565 -0.080220 0.043465 0.370359 0.381815 -0.158689 -0.132401 -0.259209 -0.113111 -0.115360 0.468731 -0.129506 0.061252 0.061177 0.099687 0.101861 0.067531 0.055727 0.189258 0.155620 0.121769 0.073475 0.086690 0.072663 0.125280 0.125667 0.115853 0.107210 0.107231 0.182876
qa: -0.4292 -0.2796 -0.4731 -0.0528 -0.2357 -0.1660 -0.4537 -0.1036 -0.0704 0.0776 -0.0802 0.0435 0.3704 0.3818 -0.1587 -0.1324 -0.2592 -0.1131 -0.1154 0.4687 -0.1295 0.0613 0.0612 0.0997 0.1019 0.0675 0.0557 0.1893 0.1556 0.1218 0.0735 0.0867 0.0727 0.1253 0.1257 0.1159 0.1072 0.1072 0.1829
va: 2.0802 2.1090 2.0159 3.2928 3.1890 3.4069 2.8845 3.8549 3.8924 3.8884 3.8557 3.9179 4.1030 4.2614 4.0338 4.0041 3.9454 3.9376 3.9700 4.3106 3.9071 1.0165 1.0141 1.0005 1.0239 1.0112 1.0198 1.0635 1.0298 1.0087 1.0028 1.0053 1.0020 1.0026 1.0006 0.9945 0.9953 0.9955 1.0542
dispcorr: -0.016048642 hartree
energy: -989.202384116604
dipole: 19.16892 -19.05433 0.11459 -11.12464 11.74359 0.61894 -6.04138 5.89473 -0.14665
magnitude: 0.64632 au
magnitude: 1.64281 debye
