program: Gaussian 09
title: 000066026
version: EM64L-G09RevD.01
frameworkgroup: C1[X(C9H12N2)]
method: RPBEPBE
basis: SDD
operation: Freq
keyword: #pfreq=noraman
keyword: PBEPBE/SDD
title: #p freq=noraman PBEPBE/SDD
converged: YES YES NO NO
title: Mulliken charges:
elementType: N N C C C C C C C C C H H H H H H H H H H H H
charge: -0.460798 -0.002236 0.469336 -0.423960 -0.377637 0.167842 -0.192526 -0.193172 -0.272122 -0.767308 -0.798521 0.211859 0.272145 0.288165 0.219217 0.219763 0.224159 0.222949 0.250762 0.222919 0.234514 0.234652 0.249998
chargesum: 0.00000
title: Mulliken charges with hydrogens summed into heavy atoms:
elementType: N N C C C C C C C C C
charge: -0.172633 -0.002236 0.469336 -0.212101 -0.105491 0.167842 0.026691 0.026591 -0.047963 -0.070678 -0.079356
polarizability: 2.03495658e+02 -1.07712568e+00 1.10982013e+02 2.51721971e-02 -3.87135832e-02 5.54289780e+01
1716.lowfreq: -5.3943 -0.0005 -0.0004 0.0007 4.0708 9.3383 54.9705 69.4583 106.0076
frequency: 54.8207 69.4355 106.0064 153.6096 182.8614 223.5190 241.7568 314.0672 314.6831 409.8417 423.6620 428.9896 509.0801 538.4540 547.9318 611.1423 621.4382 695.6476 758.0728 803.0741 830.2680 861.3788 895.6252 958.5392 960.9525 962.4924 980.5533 986.2867 1007.3261 1022.9228 1073.4283 1082.5028 1137.8661 1167.6167 1177.4417 1257.3233 1288.9375 1323.2300 1378.3325 1386.0120 1395.6518 1431.4345 1454.9546 1461.4125 1468.5795 1476.3611 1485.5557 1516.4054 1597.3999 1610.1037 1619.1819 2948.2249 2962.4823 3017.3204 3032.2740 3099.3379 3107.1194 3107.5324 3127.0943 3138.2452 3161.7908 3183.3980 3444.6291
redmass: 2.9603 4.0647 3.6828 1.0647 1.1505 3.4109 3.7378 3.0951 3.0709 2.9229 3.1260 1.3725 2.8831 4.3203 2.2999 6.0930 5.5518 1.9104 1.7364 3.9745 1.2624 3.9611 1.4537 1.4223 1.2656 1.3451 5.9952 1.3033 2.4723 1.9950 1.6036 1.5219 3.0259 1.0556 1.1087 3.4358 1.8867 1.5948 1.3700 3.3124 1.3467 1.9654 1.2369 1.0478 1.1258 1.0458 2.1303 1.8548 4.8879 6.7043 6.2420 1.0398 1.0384 1.0971 1.0973 1.0952 1.0875 1.0967 1.0865 1.0933 1.0987 1.0951 1.0744
irintensity: 0.8222 2.0108 0.3832 3.5105 1.1268 0.4389 3.0465 5.5057 3.3918 0.3443 2.7989 43.7643 17.5717 2.0242 38.3460 3.4026 12.8729 46.4200 79.9079 2.9531 0.0196 7.6507 10.5768 11.8298 0.0128 0.0015 2.6270 1.8511 12.4733 16.0977 4.2516 12.0914 133.2144 0.8765 9.6688 88.9014 34.5181 14.4823 34.0275 25.9491 8.4445 10.6574 30.6387 20.6004 15.1630 11.4174 102.8970 101.9063 18.3112 25.6218 203.3105 25.1083 58.9848 22.6086 28.6671 13.2553 18.6863 18.1065 0.8187 37.3521 33.0635 3.3122 5.5168
temp: 298.150 k
press: 1.00000 atm
elementType: 7 7 6 6 6 6 6 6 6 6 6 1 1 1 1 1 1 1 1 1 1 1 1
symmnumber: 1
zpe: 500000.9 jmol-1
zpe.correction: 0.190440 hartree
zpe.thermalcorrener: 0.201414 hartree
zpe.thermalcorrenthalpy: 0.202358 hartree
zpe.thermalcorrgfe: 0.153600 hartree
zpe.sumelectzpe: -458.817581 hartree
zpe.sumelectthermal: -458.806608 hartree
zpe.sumelectthermalent: -458.805664 hartree
zpe.sumelectthermalfe: -458.854422 hartree
dipole: -2.3053 2.0698 0.0212
dipole: 3.0982
quadrupole: -55.7518 -59.1557 -71.0926
quadrupole: -2.5230 -0.0095 -0.0075
quadrupole: 6.2482 2.8443 -9.0926 -2.5230 -0.0095 -0.0075
hfenergy: -459.0080216 hartree
pointgroup: C01 [X(C9H12N2)]
dipole: -0.8794487 -0.8418176 -0.0609687 debye
dipolederiv: -1.7995889 -0.1378595 -0.0505568 0.6480138 -0.0371678 0.0336043 -0.0226052 0.0079619 -0.3178159 0.716241 -0.1428529 0.0245769 -1.1143384 -0.2737581 -0.0421243 -0.0068186 -0.0097723 -0.1306042 1.8647615 0.2519776 0.0606548 0.5490998 0.0422945 0.0140845 0.0700557 0.0045819 0.1149546 -0.5662581 -0.1115953 -0.0138488 0.2562253 0.0632679 0.0161106 -0.002738 0.0054487 -0.2358887 -0.3162848 -0.0065108 -0.003925 -0.4903659 -0.0838661 -0.0118583 -0.0186016 0.003007 -0.2030999 -0.0394521 0.0254439 0.0032872 -0.0024344 0.4989721 0.0196596 0.0021776 0.0208973 -0.0974381 0.2490226 0.0720211 0.0134129 -0.0063998 0.1648169 0.008348 0.0112896 0.010344 -0.1365429 0.2033037 -0.0569796 0.0083815 0.0765071 0.1816356 0.0113421 0.0120506 0.0074183 -0.1384157 -0.1623672 0.0441936 0.0024907 -0.0125975 -0.2283867 -0.0007514 0.0016072 0.0012607 -0.2212804 -0.1458027 0.0488463 -0.0060933 -0.0397712 -0.1010608 -0.0074835 -0.0089623 -0.0047664 0.088589 -0.0100829 -0.0207526 -0.0056556 0.0389654 -0.2491536 -0.011703 -0.0039125 -0.0134529 0.1329039 0.051127 -0.0987057 -0.006177 -0.0697417 -0.1116146 -0.0098735 -0.0054657 -0.0109703 0.1681074 0.0709659 0.0837809 -0.0005241 0.0928196 0.0338755 -0.0008763 -0.0005083 -0.0012396 0.171303 0.0552543 0.0245111 -0.0071066 0.0732401 -0.0106003 -0.0084327 -0.0075669 -0.0114178 0.301915 -0.0377043 0.1087238 -0.0026243 0.1335198 -0.0346768 -0.0013451 -0.0018753 -0.0021566 0.1544061 0.0561769 -0.0557462 -0.0043356 -0.0858984 -0.1225807 -0.0102286 -0.0050288 -0.0093644 0.1504443 -0.1414578 -0.051515 -0.0107004 -0.0544894 0.0726049 -0.0044487 -0.0109016 -0.0044425 0.1755972 -0.088891 0.0207713 0.110123 0.0621768 0.0838267 0.0537004 0.1769321 0.0076043 -0.0463014 0.0873983 -0.1151538 -0.005103 -0.0308027 -0.0828346 -0.0079678 -0.0021787 -0.0107587 0.1193274 -0.06889 0.0282722 -0.1094631 0.0770779 0.0871085 -0.0395601 -0.1737471 0.0037778 -0.0694002 0.0864095 0.0642245 0.1056728 -0.0505011 -0.0009842 -0.0630542 0.0172686 -0.0937319 -0.0498615 0.0940903 0.0638573 -0.0917806 -0.0538938 -0.0116889 0.0625548 -0.0110112 0.1010099 -0.04697 -0.1579713 -0.0389523 -0.0107057 0.0035886 0.1199708 0.0003032 -0.0094595 -0.0012384 0.1160711 unknown
polarizability: 203.1857408|3.9303025|111.094225|4.717734|1.7432433|55.6266836 unknown
InChI: InChI=1S/C9H12N2/c1-8(2)10-11-9-6-4-3-5-7-9/h3-7,11H,1-2H3
charge 0 multiplicity 1
23 atoms
N  -0.628541 -0.595495 -0.104475
N  -1.615088 0.373205 -0.107371
C  0.73118 -0.228213 -0.053583
C  1.719116 -1.251304 -0.0532
C  1.130731 1.134835 -0.003572
C  -2.877953 -0.006297 -0.163505
C  3.087214 -0.912487 -0.004182
C  2.502729 1.455208 0.045061
C  3.492034 0.442273 0.045266
C  -3.922859 1.08502 -0.163137
C  -3.33131 -1.457855 -0.228059
H  1.41614 -2.306201 -0.091565
H  0.360665 1.909704 -0.004688
H  -0.86048 -1.594697 -0.148288
H  3.838255 -1.710893 -0.004763
H  2.802698 2.50906 0.083172
H  4.554994 0.702647 0.083284
H  -4.609561 0.982619 0.700511
H  -3.437742 2.072905 -0.112868
H  -4.547323 1.042556 -1.077626
H  -2.933902 -1.9737 -1.127073
H  -2.996332 -2.033928 0.659644
H  -4.429963 -1.522663 -0.268682
