program: Gaussian 09
title: 000066025
version: EM64L-G09RevD.01
frameworkgroup: C1[X(C8H9NO2)]
method: RPBEPBE
basis: SDD
operation: Freq
keyword: #pfreq=noraman
keyword: PBEPBE/SDD
title: #p freq=noraman PBEPBE/SDD
converged: NO YES NO NO
title: Mulliken charges:
elementType: O O N C C C C C C C C H H H H H H H H H
charge: -0.402965 -0.238527 -0.442126 0.470932 -0.421884 -0.364419 -0.422445 -0.222696 -0.193243 -0.273762 0.166606 0.329244 0.255832 0.256487 0.230411 0.218754 0.217974 0.219887 0.224883 0.391059
chargesum: 0.00000
title: Mulliken charges with hydrogens summed into heavy atoms:
elementType: O O N C C C C C C C C
charge: -0.011906 -0.238527 -0.112883 0.470932 0.090434 -0.134009 -0.203691 -0.004722 0.026644 -0.048879 0.166606
polarizability: 1.46584944e+02 3.34410539e-01 1.02771017e+02 -6.35534003e-02 -4.09747332e-02 4.50743366e+01
1716.lowfreq: -10.0441 -3.0607 0.0006 0.0007 0.0009 7.8630 45.6401 60.4001 102.1723
frequency: 45.6170 60.3914 102.1443 138.2191 225.3633 228.3666 321.9135 409.6943 469.4030 501.6961 505.8966 520.0594 541.3590 612.2318 619.4971 637.1317 692.6195 756.6426 815.2578 823.7311 871.5475 886.3087 955.7896 975.1682 977.5487 1006.7170 1023.3616 1062.0470 1083.7503 1162.0305 1170.7775 1190.1143 1200.2504 1264.6429 1290.2326 1331.9365 1366.2537 1393.2414 1436.0431 1468.5002 1485.8326 1517.5318 1588.7292 1628.1827 1667.0627 2927.1745 2957.1788 3114.5264 3123.5350 3138.0041 3148.4284 3166.5748 3521.2103 3543.2166
redmass: 5.0996 7.6633 5.3517 2.4879 4.2660 7.4221 6.1692 2.8883 1.1627 4.1175 2.5336 1.6724 6.2356 6.0007 5.8126 1.4347 1.8288 1.8089 1.2624 5.4268 1.5303 3.4799 1.3626 1.2970 5.8572 1.9149 2.2402 2.5320 1.6085 2.7505 1.1062 1.1271 1.0815 1.4980 1.7587 1.4910 2.2966 4.1538 2.2654 1.1967 1.6597 2.7339 5.3362 6.2901 7.9848 1.0587 1.0989 1.0863 1.0859 1.0928 1.0942 1.1010 1.0642 1.0770
irintensity: 0.3746 0.2004 2.2772 7.5206 0.4595 4.4945 0.6545 0.2963 119.9828 40.4723 9.6360 6.7746 21.0380 3.5114 3.6395 150.7106 52.4556 91.4443 0.1854 2.6736 12.6786 4.1949 0.0322 0.8552 3.4678 0.8093 2.4544 348.1922 24.5243 5.6419 3.0694 7.0874 0.3134 9.1783 10.3059 7.5131 141.5166 7.7711 1.7382 55.3919 0.2014 218.4641 25.4747 212.8314 208.3888 81.1317 22.5279 12.5453 4.3380 26.2470 45.2323 14.5635 42.9148 92.2459
temp: 298.150 k
press: 1.00000 atm
elementType: 8 8 7 6 6 6 6 6 6 6 6 1 1 1 1 1 1 1 1 1
symmnumber: 1
zpe: 410741.9 jmol-1
zpe.correction: 0.156443 hartree
zpe.thermalcorrener: 0.166473 hartree
zpe.thermalcorrenthalpy: 0.167418 hartree
zpe.thermalcorrgfe: 0.119965 hartree
zpe.sumelectzpe: -514.649145 hartree
zpe.sumelectthermal: -514.639115 hartree
zpe.sumelectthermalent: -514.638171 hartree
zpe.sumelectthermalfe: -514.685624 hartree
dipole: -2.0245 -1.0428 0.0152
dipole: 2.2773
quadrupole: -53.4647 -62.9732 -68.5326
quadrupole: 4.2354 -0.0033 -0.0373
quadrupole: 8.1921 -1.3164 -6.8758 4.2354 -0.0033 -0.0373
hfenergy: -514.8055888 hartree
pointgroup: C01 [X(C8H9N1O2)]
dipole: 0.7956975 0.4117867 0.0075937 debye
dipolederiv: -1.0519239 -0.5336881 0.0044582 -0.5418406 -0.6598418 0.0033694 0.0061435 0.0032369 -0.4213488 -0.7677209 0.1483999 0.0019397 -0.0829072 -0.9589419 0.0004775 0.0031261 -0.0003008 -0.309587 -1.7017828 -0.0129194 -0.0010265 0.2206961 -0.2509699 -0.0028737 0.009326 -0.0011741 -0.4814491 1.6853121 -0.147821 -0.0008023 -0.399931 0.0045803 -0.0003771 -0.002208 -0.0005716 0.1547472 0.2157372 0.2746074 0.0071443 0.8243552 0.1895738 0.0011938 0.0125677 -0.0006874 0.3791081 -0.3623336 -0.0664269 -0.0001974 0.4779434 -0.0385147 0.0024359 0.0027251 0.0016915 -0.2640418 -0.4741436 0.1081224 0.0005454 -0.2975892 0.0641125 0.0021804 -0.0018229 0.0024824 -0.2407954 0.2508767 0.1322074 0.0012419 -0.0494514 0.1783087 0.0022157 -0.0000664 0.0025185 -0.1353038 0.2178126 -0.1054516 -0.0005451 0.0030101 0.2117483 0.0025388 0.0004738 0.0025097 -0.1296851 -0.1317365 -0.0594558 -0.0001676 -0.0252802 -0.294757 -0.0004695 -0.0000445 -0.0007317 -0.2331084 1.6374678 0.1639593 -0.0097883 0.2655415 1.4150077 -0.002035 -0.0134235 -0.0015004 0.2032139 0.2768072 -0.0099555 -0.0007749 -0.1429329 0.1482454 0.0000321 -0.0053352 0.0011244 0.3201068 0.0174943 0.0120088 0.0034417 -0.1780583 -0.0094664 -0.0860625 -0.0739216 -0.1017352 -0.0420761 0.0235107 0.0133002 -0.0046681 -0.1753473 -0.012137 0.0859525 0.0642718 0.1010676 -0.0352996 -0.0189247 -0.1145246 -0.0013535 -0.1242256 -0.023676 -0.0018414 -0.0013929 -0.0017295 0.1744834 0.0309781 0.1016604 0.0006011 0.0721586 -0.0900439 -0.0019399 0.0004795 -0.0019118 0.1696259 0.0547906 0.0652347 0.0003818 0.0891194 -0.1135466 -0.0019414 0.0006875 -0.0019098 0.1528615 -0.0105645 -0.1101111 -0.0010001 -0.1230532 -0.0519269 -0.0016531 -0.0012392 -0.0015647 0.1529945 -0.1390649 0.0355503 -0.000139 0.0352784 0.0765678 -0.0007377 -0.0001355 -0.0006178 0.179694 0.2474081 0.1053033 0.0007087 0.1525144 0.2156776 -0.0004649 -0.0002116 -0.0001964 0.40586 unknown
polarizability: 146.583505|0.4202711|102.7704798|-0.005174|0.3434347|45.0763129 unknown
InChI: InChI=1S/C8H9NO2/c10-8(11)6-9-7-4-2-1-3-5-7/h1-5,9-10H,6H2
charge 0 multiplicity 1
20 atoms
O  4.045617 0.923552 -0.011419
O  3.291463 -1.276895 -0.004919
N  0.661087 -0.45518 -0.002089
C  -0.711634 -0.198298 -0.000769
C  1.669427 0.58386 0.007774
C  -1.228496 1.13118 0.008976
C  -1.632615 -1.289199 -0.009853
C  -2.623204 1.350395 0.00863
C  -3.019634 -1.05252 -0.009591
C  -3.53176 0.268726 -0.000574
C  3.050476 -0.049761 -0.004211
H  1.002762 -1.418205 0.000201
H  1.604925 1.239085 0.905117
H  1.596815 1.262078 -0.870705
H  -0.55014 1.990939 0.017222
H  -1.2501 -2.317758 -0.017447
H  -3.000057 2.380053 0.016052
H  -3.707578 -1.906146 -0.016672
H  -4.611797 0.44733 -0.000608
H  4.942543 0.491863 -0.015015
