program: Gaussian 09
title: 000066104
version: EM64L-G09RevD.01
frameworkgroup: C1[X(C24H20Si)]
method: RPBEPBE
basis: SDD
operation: Freq
keyword: #p
keyword: freq=noraman
keyword: PBEPBE/SDD
title: #p freq=noraman PBEPBE/SDD
converged: YES YES NO NO
title: Mulliken charges:
elementType: Si C C C C C C C C C C C C C C C C C C C C C C C C H H H H H H H H H H H H H H H H H H H H
charge: 1.389509 -0.174832 -0.181315 -0.174777 -0.180095 -0.325050 -0.328532 -0.327905 -0.307221 -0.308089 -0.306476 -0.306839 -0.326458 -0.248947 -0.250222 -0.248915 -0.236507 -0.236589 -0.237685 -0.238074 -0.250151 -0.233730 -0.233343 -0.233357 -0.233512 0.249983 0.250920 0.250421 0.250325 0.249139 0.251267 0.250490 0.250146 0.228818 0.228976 0.228707 0.226875 0.226659 0.226869 0.226701 0.229003 0.228379 0.228548 0.228466 0.228421
chargesum: 0.00000
title: Mulliken charges with hydrogens summed into heavy atoms:
elementType: Si C C C C C C C C C C C C C C C C C C C C C C C C
charge: 1.389509 -0.174832 -0.181315 -0.174777 -0.180095 -0.075067 -0.077611 -0.077485 -0.056896 -0.058950 -0.055209 -0.056350 -0.076312 -0.020129 -0.021246 -0.020208 -0.009632 -0.009931 -0.010816 -0.011373 -0.021148 -0.005351 -0.004795 -0.004891 -0.005091
polarizability: 2.78805365e+02 -6.95700797e-01 2.67992362e+02 4.71729255e-02 -1.04286113e-02 2.67845295e+02
1716.lowfreq: -8.1720 -6.9942 -4.9846 -0.0005 0.0002 0.0010 24.9676 27.8168 33.8250
frequency: 24.6868 27.7673 33.4785 34.6154 48.2276 50.5425 54.7192 57.4202 59.7377 163.7326 167.8460 168.9257 213.4625 219.4659 231.7791 232.1461 244.3471 253.8658 391.6623 392.4481 392.8721 396.9838 427.9351 428.0271 447.3200 464.3081 515.6768 516.1879 519.5273 615.1792 615.6504 615.8588 616.8639 660.0892 694.0884 694.3174 694.5814 706.6061 706.9491 708.2792 709.1550 746.8315 750.6764 750.9025 754.7550 861.7267 862.2674 864.1772 868.5672 927.6503 928.5137 929.3521 933.0577 981.7140 982.6247 983.6335 986.6621 987.6080 987.8334 987.9420 988.2522 998.3622 998.9892 999.7273 1000.5174 1022.1173 1023.1830 1023.3431 1023.6275 1074.2018 1074.4462 1074.7930 1078.3655 1094.7249 1099.9845 1101.1732 1101.7397 1172.9115 1172.9743 1173.1676 1173.2166 1196.9932 1197.6882 1197.7576 1200.8074 1308.8969 1309.5537 1312.4946 1315.4628 1363.5692 1363.6458 1364.8090 1365.8048 1417.8271 1418.0756 1419.1820 1421.3192 1470.1115 1470.3305 1471.0642 1471.4294 1575.8070 1575.9145 1576.4786 1577.8514 1596.0985 1596.7247 1596.7826 1597.5845 3109.7216 3110.5965 3111.4847 3112.2838 3117.4968 3117.8536 3117.9251 3118.4695 3128.7455 3129.2768 3129.3628 3130.0447 3140.7647 3141.0398 3141.1300 3141.5188 3158.0433 3158.2007 3158.3329 3158.9496
redmass: 3.7983 3.8230 4.1278 4.9399 4.7560 4.5319 5.0422 4.5954 4.9032 4.7356 4.6018 4.5959 4.5979 6.5355 5.0550 5.0613 4.6402 5.1703 2.7682 2.7708 2.7803 2.8194 5.1192 5.1170 5.3746 3.5615 5.6244 5.6116 5.4308 6.4491 6.4592 6.4592 6.4543 6.4817 6.5960 6.6534 6.6198 1.7756 1.7951 1.7754 1.9917 1.6069 1.7855 1.7955 1.8532 1.2471 1.2465 1.2455 1.2428 1.3590 1.3553 1.3545 1.3422 1.4165 1.4332 1.4453 1.7799 3.9553 5.4444 4.1930 5.4248 1.3137 1.3120 1.3098 1.3095 3.2721 3.0107 3.0058 3.0085 1.7212 1.7233 1.7097 1.7018 2.5364 2.8035 2.7880 2.7820 1.0566 1.0565 1.0564 1.0564 1.1281 1.1293 1.1289 1.1305 1.4681 1.4688 1.4213 1.4298 4.5515 4.4961 5.1448 4.9803 2.1355 2.1375 2.1334 2.1445 2.0205 2.0192 2.0166 2.0196 5.4720 5.4819 5.5462 5.5846 5.7971 5.7808 5.7886 5.8023 1.0871 1.0869 1.0865 1.0863 1.0858 1.0861 1.0860 1.0865 1.0910 1.0912 1.0912 1.0914 1.0957 1.0958 1.0958 1.0959 1.1015 1.1015 1.1015 1.1015
irintensity: 0.0299 0.0397 0.0121 0.0247 0.0040 0.0455 0.0670 0.0395 0.0387 0.1036 1.5321 1.5900 1.5348 0.0013 2.6127 2.5973 0.0115 0.9887 0.2690 0.2945 0.0398 0.0493 3.8237 3.8373 10.8558 0.0618 96.6349 98.1395 79.6583 0.0635 0.5532 0.5637 0.6817 0.0089 17.3587 19.9179 18.8968 84.7537 80.8055 75.9596 5.4567 0.2934 27.2326 26.6427 25.9694 0.0248 0.0428 0.0191 0.0666 0.0239 0.0189 0.0299 0.0020 0.0318 0.0814 0.0578 1.6167 1.4193 1.6702 1.5185 0.0748 0.0480 0.0538 0.0482 0.0138 0.0946 3.5482 3.6437 3.6649 2.1398 3.3759 1.0459 1.0411 0.3847 41.4953 44.3415 43.4011 0.3827 0.4188 0.2543 0.4409 5.7748 7.3152 7.2028 0.0510 6.1653 6.4877 0.3520 6.0781 1.9119 1.8884 0.0483 4.7355 17.9148 18.4899 1.2006 26.0668 6.0461 5.6471 12.1349 10.8046 0.4189 0.4355 0.0364 1.3086 0.1238 0.1552 0.1425 0.0140 8.1445 10.0870 1.3415 3.3762 0.0704 0.4478 0.4074 0.9867 4.3262 10.7360 8.5183 0.6191 9.5782 44.3509 36.4813 63.1462 51.3953 55.6753 53.5518 1.8919
temp: 298.150 k
press: 1.00000 atm
elementType: 14 6 6 6 6 6 6 6 6 6 6 6 6 6 6 6 6 6 6 6 6 6 6 6 6 1 1 1 1 1 1 1 1 1 1 1 1 1 1 1 1 1 1 1 1
symmnumber: 1
zpe: 939935.5 jmol-1
zpe.correction: 0.358003 hartree
zpe.thermalcorrener: 0.379807 hartree
zpe.thermalcorrenthalpy: 0.380751 hartree
zpe.thermalcorrgfe: 0.303751 hartree
zpe.sumelectzpe: -1214.257155 hartree
zpe.sumelectthermal: -1214.235351 hartree
zpe.sumelectthermalent: -1214.234407 hartree
zpe.sumelectthermalfe: -1214.311406 hartree
dipole: -0.0036 -0.0128 -0.0124
dipole: 0.0182
quadrupole: -140.8494 -143.2453 -143.2414
quadrupole: -0.2400 -0.0403 -0.0054
quadrupole: 1.5959 -0.7999 -0.7960 -0.2400 -0.0403 -0.0054
hfenergy: -1214.6151575 hartree
pointgroup: C01 [X(C24H20Si1)]
dipole: -0.0015243 -0.0058755 0.0038051 debye
polarizability: 278.7563283|-0.1031374|267.847862|1.0016988|-0.0249018|268.0388315 unknown
InChI: InChI=1S/C24H20Si/c1-5-13-21(14-6-1)25(22-15-7-2-8-16-22,23-17-9-3-10-18-23)24-19-11-4-12-20-24/h1-20H
charge 0 multiplicity 1
45 atoms
Si 0.000804 0.003194 -0.002498
C  -1.03535 1.090865 1.184899
C  -1.196961 -0.981899 -1.125398
C  1.144855 1.105056 -1.072822
C  1.090577 -1.204461 1.00717
C  -2.247959 0.596477 1.742446
C  -2.340208 -0.349594 -1.691418
C  2.376477 1.590943 -0.550166
C  0.789177 -1.521632 2.35974
C  -0.602806 2.389467 1.569534
C  -0.95961 -2.345816 -1.448546
C  0.778011 1.494676 -2.390051
C  2.210302 -1.842672 0.402841
C  -3.000355 1.369594 2.655997
C  -3.211459 -1.052139 -2.55468
C  3.209412 2.44063 -1.313498
C  1.574452 -2.448343 3.083876
C  -1.351876 3.166898 2.482736
C  -1.829107 -3.053622 -2.310365
C  1.607792 2.343877 -3.157869
C  2.997541 -2.770751 1.121797
C  -2.552101 2.657627 3.030511
C  -2.956278 -2.407548 -2.868383
C  2.825155 2.821753 -2.620198
C  2.679359 -3.077822 2.465402
H  -2.61634 -0.395333 1.450238
H  -2.562552 0.696792 -1.444702
H  2.69692 1.29125 0.45599
H  -0.057519 -1.032781 2.857076
H  0.318815 2.804642 1.14358
H  -0.096737 -2.865514 -1.014674
H  -0.156019 1.122239 -2.827945
H  2.478837 -1.602563 -0.6341
H  -3.93297 0.969831 3.070743
H  -4.086757 -0.545257 -2.977139
H  4.155087 2.800264 -0.891618
H  1.32628 -2.675509 4.12715
H  -1.001862 4.167329 2.762442
H  -1.628685 -4.106028 -2.542544
H  1.30672 2.628083 -4.172853
H  3.856406 -3.24921 0.637036
H  -3.134454 3.260003 3.737374
H  -3.631496 -2.955434 -3.535852
H  3.470218 3.479052 -3.214755
H  3.289363 -3.795812 3.025795
