program: Gaussian 09
title: 000066018
version: EM64L-G09RevD.01
frameworkgroup: C1[X(C9H11Cl)]
method: RPBEPBE
basis: SDD
operation: Freq
keyword: #pfreq=noraman
keyword: PBEPBE/SDD
title: #p freq=noraman PBEPBE/SDD
converged: NO YES NO NO
title: Mulliken charges:
elementType: Cl C C C C C C C C C H H H H H H H H H H H
charge: -0.100667 0.340537 0.325616 0.561202 -0.555623 -0.405509 -0.382580 -0.810453 -0.805414 -0.776444 0.239585 0.232228 0.236209 0.231678 0.225485 0.228363 0.228574 0.226878 0.230106 0.265546 0.264682
chargesum: 0.00000
title: Mulliken charges with hydrogens summed into heavy atoms:
elementType: Cl C C C C C C C C C
charge: -0.100667 0.340537 0.325616 0.561202 -0.316039 -0.173280 -0.146371 -0.124926 -0.119856 -0.246216
polarizability: 1.49879308e+02 3.56620203e-02 1.04203422e+02 -3.49501329e+00 5.64512743e-01 6.76943182e+01
1716.lowfreq: -14.4772 -3.2833 -0.0036 -0.0029 -0.0014 11.3214 36.6616 77.2362 117.7355
frequency: 36.6345 77.2267 117.6478 160.9248 166.9666 225.1854 266.8554 294.7173 332.7133 428.5503 439.3872 474.0287 528.5871 556.0391 634.0346 718.4192 733.6185 742.2723 835.5762 893.2519 900.2386 943.8451 957.7044 995.5387 1005.9937 1030.4550 1053.2803 1116.2288 1132.7874 1173.3402 1221.2190 1240.8237 1264.1984 1294.6002 1377.4719 1393.4154 1405.7069 1412.8640 1460.1449 1461.5379 1470.1302 1474.6392 1478.7562 1502.1374 1584.1644 1624.5035 2968.7885 2970.8558 3039.4141 3043.8845 3065.0970 3085.7201 3087.9949 3116.6862 3118.6794 3143.1881 3147.4607
redmass: 4.7336 5.3705 1.0981 1.3025 2.1777 3.0386 2.3082 2.4969 4.3761 2.8392 2.7521 4.0042 4.6408 5.3217 4.0064 4.0043 3.3844 3.4897 1.3842 1.6752 1.4222 2.4446 1.3545 1.6057 1.5148 1.4586 1.6532 1.1374 1.8355 1.5702 1.8578 1.1437 3.3464 1.5159 5.1361 1.2387 1.3345 2.4624 1.1313 1.0470 1.1967 1.0477 1.1790 2.5202 6.4339 6.3425 1.0377 1.0383 1.0967 1.0967 1.0574 1.0985 1.0978 1.0915 1.0874 1.0976 1.1112
irintensity: 1.3054 1.5016 0.0751 1.6935 1.6661 3.1779 1.4638 0.4146 9.6097 2.2586 3.6540 4.5748 24.2373 21.6384 51.9382 14.3464 6.7434 6.8003 21.0906 1.4979 6.4654 5.5384 0.7232 1.2858 6.3627 17.0998 0.0030 2.1963 9.3461 7.8581 6.2373 26.5207 27.5133 8.5397 2.0180 6.0025 20.4804 0.9964 5.2037 0.1085 26.8960 31.0937 0.8861 12.0154 3.6369 10.6837 51.9218 14.7053 40.2379 1.8231 24.4986 37.4369 3.3568 14.7503 13.3362 14.9600 11.0003
temp: 298.150 k
press: 1.00000 atm
elementType: 17 6 6 6 6 6 6 6 6 6 1 1 1 1 1 1 1 1 1 1 1
symmnumber: 1
zpe: 451148.4 jmol-1
zpe.correction: 0.171833 hartree
zpe.thermalcorrener: 0.182266 hartree
zpe.thermalcorrenthalpy: 0.183210 hartree
zpe.thermalcorrgfe: 0.134953 hartree
zpe.sumelectzpe: -808.886634 hartree
zpe.sumelectthermal: -808.876202 hartree
zpe.sumelectthermalent: -808.875258 hartree
zpe.sumelectthermalfe: -808.923515 hartree
dipole: 3.0365 -0.0636 1.5251
dipole: 3.3986
quadrupole: -68.5411 -61.2281 -68.8606
quadrupole: 1.5672 -6.7313 0.6788
quadrupole: -2.3311 4.9818 -2.6507 1.5672 -6.7313 0.6788
hfenergy: -809.0584676 hartree
pointgroup: C01 [X(C9H11Cl1)]
dipole: -1.1550514 -0.0368375 -0.6725782 debye
dipolederiv: -0.7462894 -0.0760521 -0.1465277 -0.111012 -0.2058733 -0.0329239 -0.5651224 -0.084714 -0.4327682 -0.0171894 -0.2583241 -0.0021124 -0.3379617 0.1557511 0.0164401 0.0092837 0.0332826 -0.0299911 0.370507 0.0773875 -0.0638361 0.1057545 -0.0774855 -0.0157418 -0.0751973 -0.0101804 -0.0311133 -0.2767447 -0.035765 -0.0013083 -0.0339253 -0.0096502 -0.0069675 0.1882207 0.0233675 -0.1186413 -0.0204525 0.1491256 -0.0231083 -0.0232377 0.0032747 -0.0239203 -0.0169125 -0.0217841 -0.160001 -0.2056407 0.0371283 -0.0156412 0.1363597 0.0881213 -0.0116812 0.0041695 -0.0179647 -0.1525321 0.0239822 -0.0635691 -0.0245112 0.038993 0.0251147 0.0079947 -0.0291957 -0.0137757 -0.147638 -0.048874 0.1422734 0.0121891 0.0846345 -0.0223366 -0.0115026 0.021761 -0.0188079 0.0622497 -0.1807669 -0.0281239 0.0350216 0.0596435 0.0902845 -0.0045486 0.0348221 0.0011789 0.0558819 1.0133071 0.1200753 0.2414846 0.1581939 0.1982309 0.0534247 0.4662049 0.0792745 0.5473997 0.059159 -0.063654 0.0233568 -0.0664789 -0.081806 0.020965 0.0130248 0.0177763 0.1321313 0.0364989 -0.0919211 0.0182637 -0.0760993 -0.0937589 0.0181378 0.0249288 0.0250468 0.1454619 -0.0040954 0.1082879 0.0267542 0.0925303 -0.0189431 -0.0042728 0.0157551 -0.0078745 0.1422813 0.0282452 -0.155047 0.0228511 -0.038547 -0.0881067 0.0184438 0.0135681 0.0351589 0.1037503 -0.0584277 0.0497433 -0.1143852 0.0091669 0.0554195 -0.0420351 -0.1341045 0.0126919 -0.0054378 0.0197934 0.0503019 0.0942448 0.0330065 0.0577894 0.0273329 0.1211294 -0.0367081 -0.0796064 0.0015218 0.0031113 0.044683 0.0270329 0.0514787 -0.1144714 0.1089062 -0.0760422 -0.0574509 -0.0556197 0.0195752 -0.0620332 0.0485326 0.0676614 0.0895868 -0.1194525 0.0628 -0.0254732 0.0699467 0.0074418 0.0052482 -0.1101312 -0.1447124 0.0274755 0.0117899 0.0115531 0.1074876 0.009914 -0.0036624 -0.0495269 -0.083716 -0.0326672 0.088956 -0.054686 0.0502018 -0.033816 -0.0187751 0.0116672 -0.0211068 0.0872606 -0.0177864 -0.1006921 -0.0388934 -0.0644809 -0.0221743 unknown
polarizability: 149.9722002|1.0894828|104.2348544|1.551919|0.3810187|67.5699936 unknown
InChI: InChI=1S/C9H11Cl/c1-7-3-4-9(6-10)5-8(7)2/h3-5H,6H2,1-2H3
charge 0 multiplicity 1
21 atoms
Cl 3.650922 0.353811 1.019462
C  -1.068542 0.822022 -0.049069
C  -1.5822 -0.505795 0.09458
C  1.208563 -0.09636 -0.375925
C  0.313927 1.000567 -0.281442
C  -0.68693 -1.600097 -0.000613
C  0.690455 -1.407042 -0.231439
C  -1.990954 2.023749 0.045749
C  -3.059475 -0.744481 0.345462
C  2.666091 0.128414 -0.627746
H  0.70946 2.019323 -0.384627
H  -1.080172 -2.617986 0.108295
H  1.364998 -2.269274 -0.293526
H  -1.435459 2.966923 -0.089447
H  -2.789166 1.986395 -0.720758
H  -2.498946 2.068566 1.02856
H  -3.398348 -0.248283 1.275533
H  -3.683043 -0.336496 -0.473759
H  -3.280896 -1.821108 0.435867
H  2.876714 1.058938 -1.17348
H  3.162902 -0.729186 -1.102679
