program: Gaussian 09
title: 000066016
version: EM64L-G09RevD.01
frameworkgroup: C1[X(C11H18N2)]
method: RPBEPBE
basis: SDD
operation: Freq
keyword: #pfreq=noraman
keyword: PBEPBE/SDD
title: #p freq=noraman PBEPBE/SDD
converged: YES YES NO NO
title: Mulliken charges:
elementType: N N C C C C C C C C C C C H H H H H H H H H H H H H H H H H H
charge: -0.101159 -0.297077 -0.339015 -0.480272 -0.370091 0.444576 -0.639333 -0.380639 -0.447208 -0.225659 -0.221273 -0.622653 -0.246741 0.159507 0.230056 0.227896 0.187414 0.222523 0.182702 0.222451 0.250738 0.186786 0.249940 0.266346 0.231075 0.223353 0.223092 0.227321 0.188793 0.220639 0.225913
chargesum: 0.00000
title: Mulliken charges with hydrogens summed into heavy atoms:
elementType: N N C C C C C C C C C C C
charge: -0.101159 -0.047137 0.050549 -0.064962 0.035134 0.444576 0.020642 -0.114293 -0.216132 -0.002306 0.001818 0.014100 -0.020828
polarizability: 1.78478513e+02 1.34974292e+00 1.26872121e+02 3.77066176e+00 5.07719130e+00 8.59344558e+01
1716.lowfreq: -17.3695 -5.0553 -0.0006 0.0002 0.0004 4.2973 25.6290 31.5681 36.4521
frequency: 24.0542 29.5765 36.3289 72.5025 97.8155 131.0961 151.7162 201.0317 224.3345 234.1235 249.0482 304.1406 338.5399 368.3730 406.3193 427.9959 468.4146 509.5970 610.6984 616.6530 663.5658 705.4449 743.7477 802.8269 808.4440 840.2397 859.4657 915.6768 962.6724 980.2617 983.9834 990.0053 1001.1151 1016.1344 1026.1268 1036.3824 1067.8913 1078.8935 1105.0792 1115.3668 1138.2189 1159.5250 1168.4894 1169.1757 1179.0238 1200.1171 1211.3207 1251.9913 1265.7178 1297.1720 1307.5221 1322.8450 1350.6004 1382.4620 1394.4999 1429.2772 1435.7254 1441.2006 1445.1877 1455.7386 1465.0302 1472.7913 1473.8122 1477.0167 1482.3105 1488.2095 1496.2437 1594.3034 1614.6304 2819.5997 2840.9124 2858.1952 2860.1932 2871.1338 2994.8716 3012.9408 3022.6350 3037.3483 3047.4750 3074.2659 3092.5357 3110.6602 3121.7814 3135.1650 3147.1635 3160.8933 3441.7715
redmass: 2.1215 2.6564 3.7090 2.8274 3.1461 2.1202 3.3312 1.2467 1.2164 2.7900 3.4675 3.2533 2.3239 2.1082 2.8455 3.0889 3.1387 3.4429 4.5681 6.3132 1.3033 2.1531 1.5266 1.5143 2.4405 3.5700 1.2533 1.3583 2.0997 1.6139 1.4822 5.9114 1.3938 2.3990 1.9525 1.7231 2.2008 1.5289 1.2854 1.4779 2.1836 2.1420 1.7828 1.2476 1.1269 1.8845 2.2219 1.4546 1.5252 1.2963 1.3864 1.3103 1.4779 3.3097 1.7186 1.2561 1.1519 1.8135 1.2414 1.1078 1.0682 1.0760 1.0942 1.0705 2.0680 1.0647 1.0626 6.1683 6.1427 1.0707 1.0699 1.0621 1.0644 1.0586 1.0861 1.0745 1.0854 1.0719 1.0898 1.0996 1.1010 1.0871 1.0861 1.0916 1.0952 1.1013 1.0742
irintensity: 1.1489 1.2417 0.2043 1.0237 0.7764 2.7683 0.6523 2.2679 2.5280 2.2165 0.2275 2.3503 0.8285 9.6950 0.4164 11.1279 9.6643 4.5413 1.8342 0.3918 118.8495 36.3945 60.3350 0.2692 15.3184 12.4642 0.0252 4.2700 9.7999 4.0665 2.1104 0.0838 4.5421 39.3070 7.0412 68.7501 14.9123 7.7551 0.6389 5.9935 10.8499 1.3940 34.1899 8.7306 0.5842 1.9239 5.5577 10.3838 6.6801 5.0656 19.4876 3.7073 8.5473 1.6320 2.3172 9.5579 1.6879 16.9954 22.3189 2.5776 10.7859 2.3946 19.9634 9.4716 7.1222 18.5333 9.2842 0.7106 7.1047 95.5915 84.4438 105.3848 133.8244 186.3633 19.4949 53.6542 19.3026 32.8249 41.5292 42.4857 31.3771 9.5589 0.3557 22.1586 31.2125 27.8930 1.7051
temp: 298.150 k
press: 1.00000 atm
elementType: 7 7 6 6 6 6 6 6 6 6 6 6 6 1 1 1 1 1 1 1 1 1 1 1 1 1 1 1 1 1 1
symmnumber: 1
zpe: 708341.1 jmol-1
zpe.correction: 0.269793 hartree
zpe.thermalcorrener: 0.284029 hartree
zpe.thermalcorrenthalpy: 0.284973 hartree
zpe.thermalcorrgfe: 0.226541 hartree
zpe.sumelectzpe: -538.421642 hartree
zpe.sumelectthermal: -538.407406 hartree
zpe.sumelectthermalent: -538.406462 hartree
zpe.sumelectthermalfe: -538.464894 hartree
dipole: -0.7510 -0.8280 1.1123
dipole: 1.5770
quadrupole: -72.5027 -74.7401 -84.2536
quadrupole: 0.4191 -3.7674 0.3555
quadrupole: 4.6628 2.4253 -7.0881 0.4191 -3.7674 0.3555
hfenergy: -538.6914351 hartree
pointgroup: C01[X(C11H18N2)]
dipole: 0.3074667 -0.5345157 -0.0684192 debye
polarizability: 178.4862653|3.3416554|100.1523464|2.6054767|-20.081108|112.646478 unknown
InChI: InChI=1S/C11H18N2/c1-12-8-9-13(2)10-11-6-4-3-5-7-11/h3-7,12H,8-10H2,1-2H3
charge 0 multiplicity 1
31 atoms
N  0.870835 -0.466408 0.098454
N  4.59287 0.287601 0.255793
C  2.225707 -0.285224 0.670276
C  -0.206286 -0.343064 1.11065
C  3.263095 0.168807 -0.376765
C  -1.584792 -0.106462 0.496614
C  0.73763 -1.706079 -0.697528
C  -1.732442 0.717754 -0.647702
C  -2.742523 -0.666237 1.090271
C  -3.012761 0.980797 -1.182417
C  -4.02672 -0.400687 0.56045
C  5.644652 0.832945 -0.621486
C  -4.1661 0.425059 -0.578545
H  2.592756 -1.222988 1.16843
H  2.182227 0.493811 1.452516
H  0.049387 0.521442 1.755356
H  -0.257771 -1.237578 1.784476
H  2.9653 1.163274 -0.758573
H  3.262163 -0.524861 -1.255138
H  1.485873 -1.724133 -1.507515
H  -0.263361 -1.744915 -1.159494
H  0.871081 -2.629266 -0.077465
H  4.879274 -0.596469 0.697778
H  -0.82835 1.129376 -1.11032
H  -2.639355 -1.314234 1.970265
H  -3.113316 1.618402 -2.068589
H  -4.913464 -0.841239 1.030716
H  5.391032 1.873373 -0.897743
H  5.796244 0.262914 -1.571852
H  6.606504 0.858108 -0.078938
H  -5.159789 0.629379 -0.993375
