program: Gaussian 09
title: 000065977
version: EM64L-G09RevD.01
frameworkgroup: C1[X(C9H16N2O4)]
method: RPBEPBE
basis: SDD
operation: Freq
keyword: #p
keyword: freq=noraman
keyword: PBEPBE/SDD
title: #p freq=noraman PBEPBE/SDD
converged: YES YES NO NO
title: Mulliken charges:
elementType: O O O O N N C C C C C C C C C H H H H H H H H H H H H H H H H
charge: -0.406216 -0.234459 -0.273493 -0.271700 -0.400755 -0.366521 -0.386501 -0.329824 -0.128690 -0.407672 0.135805 0.256886 0.255380 -0.770794 -0.768026 0.223279 0.199761 0.236670 0.219024 0.295811 0.266544 0.208565 0.323152 0.295061 0.254527 0.256128 0.215545 0.388001 0.255038 0.253965 0.205513
chargesum: 0.00000
title: Mulliken charges with hydrogens summed into heavy atoms:
elementType: O O O O N N C C C C C C C C C
charge: -0.018215 -0.234459 -0.273493 -0.271700 -0.077602 -0.071461 0.036539 0.125869 0.167121 0.067436 0.135805 0.256886 0.255380 -0.044595 -0.053511
polarizability: 1.44925199e+02 4.20462485e+00 1.31623850e+02 1.55509130e+01 -2.75937904e+00 9.79617964e+01
1716.lowfreq: -16.5023 -4.8080 0.0004 0.0007 0.0008 4.0524 10.9333 18.5328 39.3983
frequency: 10.7621 17.2482 39.3643 49.1255 59.4448 69.5044 72.5302 83.4291 100.8999 119.7102 138.8568 169.1875 216.8031 242.6219 295.0552 312.3099 343.0581 391.6709 430.4985 471.1430 502.9124 540.2250 567.0040 590.5313 593.8571 597.5895 605.8081 609.7500 615.4679 696.1809 743.3521 831.4615 863.6017 905.3499 932.0311 958.5647 972.0895 993.6485 998.2444 1040.1325 1042.0035 1058.5637 1087.1664 1089.8271 1106.2700 1137.2886 1188.3074 1219.5379 1240.7186 1255.3140 1263.3685 1282.1848 1306.1085 1322.0931 1338.1280 1352.3024 1364.0154 1386.2172 1390.5252 1448.0957 1449.6561 1450.6454 1456.6485 1463.1355 1467.5913 1468.0339 1482.5923 1486.9930 1615.6865 1624.5581 1652.1224 2968.1475 2977.2189 2994.7702 2998.7779 3003.2465 3017.7562 3036.0663 3069.0199 3074.6443 3096.4512 3098.1256 3099.4894 3104.3965 3515.6928 3529.1717 3559.7847
redmass: 4.8340 4.1966 4.5515 5.3910 7.0292 1.6772 1.4809 1.3524 3.8713 3.7807 2.1314 4.1018 4.6686 4.2557 2.5688 3.8225 4.1403 3.2428 2.8854 2.2234 2.9926 1.4635 1.8244 3.1867 3.1535 1.4846 2.3034 2.2284 3.1056 3.4971 1.4280 2.0159 5.1121 2.9118 2.4930 2.6834 2.5151 1.7824 1.8081 1.6494 1.6479 2.4312 2.7195 2.5068 3.6133 2.4368 1.4370 1.2613 1.6365 1.8131 1.5732 1.2890 1.2274 1.2594 2.2498 1.4394 1.3201 1.2288 1.2271 1.0964 1.0477 1.0569 1.1432 1.1683 1.1014 1.0869 1.6866 1.8116 6.5665 6.3333 8.4425 1.0608 1.0666 1.0362 1.0361 1.0610 1.0838 1.0979 1.0975 1.1012 1.1004 1.0985 1.0980 1.1004 1.0642 1.0775 1.0775
irintensity: 7.7311 0.3354 4.2506 1.3760 8.5014 0.7043 8.2804 0.3722 6.2338 5.2198 1.1869 9.1476 3.1362 0.3066 7.8496 2.0414 1.8410 15.3690 8.0126 20.1666 34.4010 144.0970 12.2749 22.8069 11.8462 136.4754 29.7517 4.5570 33.0539 40.7239 20.5685 11.0658 4.5002 7.4086 5.7157 4.7370 8.2829 10.7107 2.2465 14.2766 18.1818 212.4739 14.2028 6.5765 12.7083 10.7293 5.3379 15.0593 28.6440 53.4910 81.4856 21.2700 34.2762 14.6687 132.8462 2.9193 1.1044 61.1928 64.7140 9.0141 26.0023 13.3045 56.4806 98.4492 51.9565 9.0611 160.2950 140.2916 192.9001 220.1625 178.6155 22.4281 49.2784 13.1840 9.5337 19.2765 6.3854 13.9917 30.6705 17.2956 23.2823 10.6803 9.2004 16.0879 31.8540 38.4174 9.6897
temp: 298.150 k
press: 1.00000 atm
elementType: 8 8 8 8 7 7 6 6 6 6 6 6 6 6 6 1 1 1 1 1 1 1 1 1 1 1 1 1 1 1 1
symmnumber: 1
zpe: 660515.0 jmol-1
zpe.correction: 0.251577 hartree
zpe.thermalcorrener: 0.269427 hartree
zpe.thermalcorrenthalpy: 0.270371 hartree
zpe.thermalcorrgfe: 0.201053 hartree
zpe.sumelectzpe: -761.812695 hartree
zpe.sumelectthermal: -761.794844 hartree
zpe.sumelectthermalent: -761.793900 hartree
zpe.sumelectthermalfe: -761.863218 hartree
dipole: -1.9256 4.9078 -3.2716
dipole: 6.2047
quadrupole: -97.3675 -86.7372 -92.8514
quadrupole: 18.2768 -0.0807 9.7352
quadrupole: -5.0488 5.5815 -0.5327 18.2768 -0.0807 9.7352
hfenergy: -762.0642716 hartree
pointgroup: C01 [X(C9H16N2O4)]
dipole: 0.6480133 -1.8100118 -1.5043281 debye
polarizability: 143.0687518|5.8397951|130.6903593|-17.7020525|5.6758794|100.7517348 unknown
InChI: InChI=1S/C9H16N2O4/c1-6(12)10-5-3-4-8(9(14)15)11-7(2)13/h8,10-11,14H,3-5H2,1-2H3
charge 0 multiplicity 1
31 atoms
O  1.335879 -2.994751 0.334343
O  2.96975 -2.201768 -1.113741
O  2.115705 1.749627 1.379733
O  -4.398182 1.480654 0.679045
N  2.345262 0.417578 -0.512317
N  -3.086113 -0.040352 -0.501795
C  -0.013163 -0.503984 -0.65236
C  -0.717789 0.822426 -0.297468
C  1.416577 -0.608259 -0.028198
C  -2.1083 0.962444 -0.958532
C  2.0154 -1.977706 -0.334826
C  2.673672 1.524524 0.262833
C  -4.172578 0.291804 0.299777
C  3.733304 2.447954 -0.326889
C  -5.079603 -0.873529 0.691187
H  -0.600484 -1.363837 -0.276218
H  0.067888 -0.606789 -1.754401
H  -0.819236 0.917128 0.799238
H  -0.09164 1.671683 -0.630912
H  1.324642 -0.477383 1.067158
H  -2.543169 1.945019 -0.705529
H  -2.011192 0.901569 -2.061592
H  2.898473 0.185959 -1.34161
H  -2.962081 -1.013899 -0.781707
H  3.294322 3.448514 -0.484032
H  4.55279 2.564034 0.4027
H  4.150552 2.087815 -1.282727
H  1.736972 -3.875954 0.101853
H  -5.115526 -0.945617 1.79185
H  -6.105857 -0.66189 0.344956
H  -4.756473 -1.846015 0.27998
