program: Orca
programVersion: 5.0.2
elementType: Cl Cl O O O N C C C C C C C C C C C C H H H H H H H H H
charge: 0
multiplicity: 1
keywords: wb97x-d3
keywords: def2-TZVPP
keywords: def2/J RIJCOSX
keywords: DEFGRID2
keywords: scfconv7
keywords: smallprint printgap noloewdin
keywords: NOSOSCF
formula: C12H9Cl2NO3
InChI: InChI=1/C12H9Cl2NO3/c1-3-12(2)10(16)15(11(17)18-12)9-5-7(13)4-8(14)6-9/h3-6H,1H2,2H3
27 atoms
Cl 3.598628 -2.248213 0.872641
Cl 2.963561 2.754933 -0.960546
O  -2.996603 -1.150791 -0.403267
O  -1.613907 1.454588 1.447429
O  -1.214313 -2.101384 -1.35321
N  -1.022948 -0.262493 0.030797
C  -3.277486 -0.025609 0.435432
C  -1.895395 0.524892 0.740361
C  -3.984066 -0.485833 1.697267
C  -1.697859 -1.261774 -0.651241
C  0.381128 -0.099104 -0.000784
C  -4.061814 1.012745 -0.31481
C  0.906815 1.108724 -0.431324
C  1.194331 -1.14225 0.413531
C  2.565521 -0.957896 0.375835
C  2.283236 1.258377 -0.434865
C  -4.367376 0.960613 -1.602375
C  3.131166 0.237052 -0.039341
H  -4.169029 0.367168 2.347744
H  -4.944097 -0.933593 1.444167
H  -3.383934 -1.214677 2.241655
H  -4.375661 1.853524 0.293737
H  0.259008 1.906384 -0.767842
H  0.768044 -2.071164 0.765935
H  -4.941784 1.758407 -2.053418
H  -4.077844 0.145714 -2.252322
H  4.204042 0.369073 -0.054904
elementType: Cl O N C H
totalener: -1663.64292884 hartree
nucrepener: 1521.35535360 hartree
electener: -3184.99828244 hartree
oneelecener: -5305.51533012 hartree
twoeener: 2120.51704768 hartree
cpcmener: -0.02989502 hartree
kineticenergy: 1659.31253042 hartree
xcener: -112.235446829850 hartree
chargesum: 0.0000000
charge: -0.070169 -0.070186 -0.282751 -0.431773 -0.428253 -0.053203 0.334989 0.289475 -0.266891 0.447069 0.106721 -0.240370 -0.211926 -0.200887 0.117545 0.121218 -0.228880 -0.126692 0.109037 0.118543 0.116855 0.154509 0.151374 0.147861 0.140084 0.125465 0.131235
qa: -0.0702 -0.0702 -0.2828 -0.4318 -0.4283 -0.0532 0.3350 0.2895 -0.2669 0.4471 0.1067 -0.2404 -0.2119 -0.2009 0.1175 0.1212 -0.2289 -0.1267 0.1090 0.1185 0.1169 0.1545 0.1514 0.1479 0.1401 0.1255 0.1312
va: 1.2319 1.2321 2.1605 2.0918 2.0829 3.1370 3.7991 4.1757 3.9321 4.3661 3.7273 3.8484 4.1003 4.1020 3.9123 3.9063 3.9683 4.0313 1.0088 1.0050 1.0047 1.0085 1.0176 1.0198 1.0007 1.0134 1.0155
dispcorr: -0.013559789 hartree
energy: -1663.656488625363
dipole: -28.24988 26.99503 -1.25486 1.31150 -0.78024 0.53126 2.02580 -1.50052 0.52527
magnitude: 1.46041 au
magnitude: 3.71208 debye
